{"text_format":"1","workbook":"xlsx","n_sheets":11,"sheets":["Instructions","Summary","Vehicles","Engine","Drivetrain","Suspension","Brakes","Exterior","Weight","Tires","not used"],"not_rendered":{"charts":0,"images":0,"macros":1,"external_links":0,"defined_names":136,"comments":0,"pivot_tables":0},"unopened":[],"bounds":{"document_bytes":16777216,"sheet_cells":100000,"rows_first":2000,"rows_last":500,"rows_between":2000,"halvings":0,"cell_chars":16384,"cell_head_chars":4096},"cells_cut":0,"cells_raw":0,"read":"whole","date_system":"1900"}

{"sheet":"Instructions","index":0,"n_rows":38,"n_cols":6,"rows_kept":38,"cut":false,"hidden":false,"merged":[[0,2,0,4],[37,0,37,4],[8,0,14,9],[28,1,35,8],[16,1,17,8],[2,0,4,9],[19,0,20,9],[22,0,22,9],[24,1,24,8],[26,3,26,9]]}
["Start page",null,{"$f":"CONCATENATE(Title, \" \", Version)","v":"COMSCC 2024 v12.0"}]
[]
["All drivers must submit a completed sheet. "]
[]
[]
[]
["All dyno sheets must be no more than 3 years old, and are expected to represent the car as it is today"]
[]
["A Dyno sheet is not required in Touring classes. GENERALLY speaking,  the more modifications you have, you may benefit from using a dyno sheet instead of adding up your modifications and assigning points for each.  But if your car's HP/TQ is overstated by the manufacturer, you may also benefit by dyno testing your stock-ish engine as well.  It's up to you to decide."]
[]
[]
[]
[]
[]
[]
[]
[null,"Start on the \"Summary\" Tab, and step through from there to complete your sheet"]
[]
[]
["The sheet was built in Excel, and works best in Excel.  Using it in Google sheets or anything else may result in some of the cool automatic functions not working for you.  We've had some really smart people try to find a way to make it work in alternate Applications.  If you would like to give it a try contact the Chief Steward and he'll be happy to let you have a crack at it."]
[]
[]
["Please save your downloaded, completed sheet with the title in this format:"]
[]
[null,"Class_carnumber_lastname_firstname_additional information"]
[]
[null,"Example:",null,"T50_12_Giurlando_Paul_Wet.xlxs"]
[]
[null,"Yes, you may submit multiple configurations of the same car.  You are responsible for declaring to a Steward which sheet you are using the morning of the TT, if it's not obvious due to weather, or risk disqualification.\n\nYou may also choose to \"run up\" a class.  Please name your file with the class you wish to compete in"]
[]
[]
[]
[]
[]
[]
[]
[]
["Please email your completed sheet to",null,null,null,null,"rules@comscc.org"]

{"sheet":"Summary","index":1,"n_rows":70,"n_cols":8,"rows_kept":70,"cut":false,"hidden":false,"merged":[[0,0,0,2],[49,0,52,1],[4,0,4,2]]}
[{"$f":"CONCATENATE(Title, \" \", Version)","v":"COMSCC 2024 v12.0"}]
[]
["Homepage","v12.0","COMSCC 2024"]
[]
["IMPORTANT- THIS SHEET FOR TOURING CLASSIFICATIONS ONLY -\nFor Super Class cars, please see the separate \"Super\" Spreadsheet"]
[]
["1. Select your Car from the Showroom Assessment List (\"Vehicles\" tab below)"]
["2. Use the Worksheets (tabs below) to enter modifications, to determine the Modification Assessment for your vehicle"]
["3. Note - do not attempt to edit any cells on this page, all values will auto-populate from other fields and sheets."]
[]
["Showroom Assessment","Go to Car List"]
["Make",{"$f":"IF(ISBLANK(INDEX(Selected_Vehicle,1)), \"Select a car\", INDEX(Selected_Vehicle,1))","v":""}]
["Model",{"$f":"IF(ISBLANK(INDEX(Selected_Vehicle,2)), \"from list\", INDEX(Selected_Vehicle,2))","v":""}]
["Factory Rated Crank HP",{"$f":"IF(ISBLANK(INDEX(Selected_Vehicle,6)), \"\", INDEX(Selected_Vehicle,6))","v":""}]
["Factory Rated Torque",{"$f":"IF(ISBLANK(INDEX(Selected_Vehicle,7)), \"\", INDEX(Selected_Vehicle,7))","v":""}]
["Showroom Base Weight",{"$f":"IF(ISBLANK(INDEX(Selected_Vehicle,5)), \"\", INDEX(Selected_Vehicle,5))","v":""},null,null,{"$f":"IF(Is_Safety_upgrade, \"Highly Modified Touring Safety Requirements\", \"\")","v":""}]
["Showroom Assessment Points",{"$f":"Car_Base_Points","v":""},null,null,{"$f":"IF(Is_Safety_upgrade, INDEX(Safety_Rules,1), \"\")","v":""}]
["Touring Class Base Classification",{"$f":"Car_Base_Class","v":""},null,null,{"$f":"IF(Is_Safety_upgrade, INDEX(Safety_Rules,2), \"\")","v":""}]
[null,null,null,null,{"$f":"IF(Is_Safety_upgrade, INDEX(Safety_Rules,3), \"\")","v":""}]
["Category","Assessment",null,null,{"$f":"IF(Is_Safety_upgrade, INDEX(Safety_Rules,4), \"\")","v":""}]
["Engine",{"$f":"Total_Engine","v":0},"Go to Engine Worksheet",null,{"$f":"IF(Is_Safety_upgrade, INDEX(Safety_Rules,5), \"\")","v":""}]
["Drivetrain",{"$f":"Total_Drivetrain","v":0},"Go to Drivetrain Worksheet",null,{"$f":"IF(Is_Safety_upgrade, INDEX(Safety_Rules,6), \"\")","v":""}]
["Suspension",{"$f":"Total_Suspension","v":0},"Go to Suspension Worksheet",null,{"$f":"IF(Is_Safety_upgrade, INDEX(Safety_Rules,7), \"\")","v":""}]
["Brakes",{"$f":"Total_Brakes","v":0},"Go to Brakes Worksheet",null,{"$f":"IF(Is_Safety_upgrade, INDEX(Safety_Rules,8), \"\")","v":""}]
["Exterior",{"$f":"Total_Exterior","v":0},"Go to Exterior Worksheet",null,{"$f":"IF(Is_Safety_upgrade, INDEX(Safety_Rules,9), \"\")","v":""}]
["Weight Reduction",{"$f":"Total_Weight","v":"Enter Weight"},"Go to Weight Reduction Worksheet",null,{"$f":"IF(Is_Safety_upgrade, INDEX(Safety_Rules,10), \"\")","v":""}]
["Tires",{"$f":"Total_Tire","v":"No Tire"},"Go to Tire Worksheet",null,{"$f":"IF(Is_Safety_upgrade, INDEX(Safety_Rules,11), \"\")","v":""}]
["Total ",{"$f":"SUM(Assessments)","v":0},null,null,{"$f":"IF(Is_Safety_upgrade, INDEX(Safety_Rules,12), \"\")","v":""}]
[{"$f":"IF(Safety_mods,\"Safety Upgrades Required for vehicles with 31+ modification points\",IF(Safety_Engine,\"Safety Upgrades Required for vehicles with 16+ engine modification points\",\"\"))","v":""},null,null,null,{"$f":"IF(Is_Safety_upgrade, INDEX(Safety_Rules,13), \"\")","v":""}]
[{"$f":"IF(Competition_class=\"T110\",\"Note: The Classification says T110 to make the sheet work; your class is actually TU\",\"\")","v":""},null,null,null,{"$f":"IF(Is_Safety_upgrade, INDEX(Safety_Rules,14), \"\")","v":""}]
["Total Assessment",{"$f":"IF(ISNUMBER(Showroom_Assessment_Points), Showroom_Assessment_Points+Points_Assessment-0.0499999999999, \"No Vehicle\")","v":"No Vehicle"},null,null,{"$f":"IF(Is_Safety_upgrade, INDEX(Safety_Rules,15), \"\")","v":""}]
["Tire Class Selected",{"$f":"Tire_Competition_Class","v":0},null,null,{"$f":"IF(Is_Safety_upgrade, INDEX(Safety_Rules,15), \"\")","v":""}]
["Classification",{"$f":"Class_max","v":"Tire Class Not Set"},null,null,null,{"$f":"IF(ISNUMBER(Total_Assessment),INDEX(Base_Classes, MATCH(Total_Assessment, Base_Assessments, 1)+1), \"\")","v":""},{"$f":"Tire_Competition_Class","v":0},{"$f":"IF(ISBLANK(Tire_Competition_Class), \"Tire Class Not Set\", IF(VALUE(MID(ClassificationTire,2,3))>VALUE(MID(Classification,2,3)),CONCATENATE(ClassificationTire,\" (tire sheet)\"),Classification))","v":"Tire Class Not Set"}]
[]
["Safety upgrades required (engine)?",{"$f":"IF(ISNUMBER(Total_Assessment), Total_Engine>=16, FALSE)","v":false}]
["Safety upgrades required?",{"$f":"IF(ISNUMBER(Total_Assessment), Points_Assessment>=31, FALSE)","v":false}]
[null,{"$f":"OR(B35, B36)","v":false}]
["Base Assessment","Base Class"]
[-10000,"T0"]
[39.950000000000003,"T30"]
[49.95,"T40"]
[59.95,"T50"]
[69.95,"T60"]
[79.95,"T70"]
[89.95,"T80"]
[99.95,"T90"]
[109.95,"T100"]
[1000,"T110"]
[]
[]
[]
[]
[]
[]
["Refer to Official Rules Document for full description"]
[" "]
["● 5+ point safety harness (SFI or FIA approved and not expired)"]
["● Minimum of single layer full length fire suit, gloves and footwear"]
["● Roll bar or roll cage"]
["● Window nets or arm restraints"]
[" "]
[" "]
[" "]
[" "]
[" "]
[" "]
[" "]
[" "]
[" "]
[" "]

{"sheet":"Vehicles","index":2,"n_rows":507,"n_cols":21,"rows_kept":507,"cut":false,"hidden":false,"merged":[[0,0,0,2]]}
[{"$f":"CONCATENATE(Title, \" \", Version)","v":"COMSCC 2024 v12.0"}]
[]
["Touring Class Summary"]
[]
["Showroom Assessment Car List"]
["Click \"Select\" next to your vehicle on the list below"]
[]
["Selected Vehicle",{"$f":"IF(Car_Select_Error,\"Error Multiple\",IF(Car_Valid,OFFSET(Car_List,MATCH(TRUE,Car_Selected_Truth,0)-1,1,1,1),\"\"))","v":""},{"$f":"IF(Car_Select_Error,\"Vehicles Selected\",IF(Car_Valid,OFFSET(Car_List,MATCH(TRUE,Car_Selected_Truth,0)-1,2,1,1),\"\"))","v":""},{"$f":"IF(Car_Valid, OFFSET(Car_List, MATCH(TRUE, Car_Selected_Truth, 0)-1, 3, 1, 1),\"\")","v":""},{"$f":"IF(Car_Valid, OFFSET(Car_List, MATCH(TRUE, Car_Selected_Truth, 0)-1, 4, 1, 1),\"\")","v":""},{"$f":"IF(Car_Valid, OFFSET(Car_List, MATCH(TRUE, Car_Selected_Truth, 0)-1, 5, 1, 1),\"\")","v":""},{"$f":"IF(Car_Valid, OFFSET(Car_List, MATCH(TRUE, Car_Selected_Truth, 0)-1, 6, 1, 1),\"\")","v":""},{"$f":"IF(Car_Valid, OFFSET(Car_List, MATCH(TRUE, Car_Selected_Truth, 0)-1, 7, 1, 1),\"\")","v":""},{"$f":"IF(Car_Valid, OFFSET(Car_List, MATCH(TRUE, Car_Selected_Truth, 0)-1, 8, 1, 1),\"\")","v":""},{"$f":"IF(Car_Valid, OFFSET(Car_List, MATCH(TRUE, Car_Selected_Truth, 0)-1, 9, 1, 1),\"\")","v":""},{"$f":"IF(Car_Valid, OFFSET(Car_List, MATCH(TRUE, Car_Selected_Truth, 0)-1, 10, 1, 1),\"\")","v":""},{"$f":"IF(Car_Valid, OFFSET(Car_List, MATCH(TRUE, Car_Selected_Truth, 0)-1, 11, 1, 1),\"\")","v":""},{"$f":"IF(Car_Valid, OFFSET(Car_List, MATCH(TRUE, Car_Selected_Truth, 0)-1, 12, 1, 1),\"\")","v":""},{"$f":"IF(Car_Valid, OFFSET(Car_List, MATCH(TRUE, Car_Selected_Truth, 0)-1, 13, 1, 1),\"\")","v":""},{"$f":"IF(Car_Valid, OFFSET(Car_List, MATCH(TRUE, Car_Selected_Truth, 0)-1, 14, 1, 1),\"\")","v":""}]
[null,null,null,null,null,null,null,null,null,null,null,null,null,null,null,null,{"$f":"IF(R9=1, TRUE, FALSE)","v":false},{"$f":"COUNTIF(Car_Selected_Truth, \"TRUE\")","v":0},{"$f":"IF(R9>1, TRUE, FALSE)","v":false}]
[]
["Click \"Select\" to choose Vehicle","Make","Model","Start Year","End Year","Showroom Base Weight (lbs)","Factory Rated HP","Factory Rated Torque","Power (2/3HP + 1/3Torque)","Weight/ Power","Scaled Weight/ Power","SUSP Index","Performance Adjustment","Showroom Assessment","Base Classification","p","q","Selected","Assessment"]
[null," Custom"," Custom",1900,2099,null,null,null,{"$f":"G12*(2/3)+H12*(1/3)","v":0},{"$f":"F12/I12","v":{"$error":"#DIV/0!"}},{"$f":"J12*-4.25+112","v":{"$error":"#DIV/0!"}},null,{"$f":"(L12-60)/3*1.5","v":-30},{"$f":"IF(ISNUMBER(M12),M12+K12, 0)","v":{"$error":"#DIV/0!"}},{"$f":"INDEX(Base_Classes, MATCH($N12, Base_Assessments, 1)+1)","v":{"$error":"#DIV/0!"}},{"$f":"OR(R12,A12)","v":false},null,false,null,null,{"$f":"AND(P12,$S$9)","v":false}]
[null,"Acura","Integra Type R",1995,2001,2639,195,130,173.33333333333331,15.225000000000001,47.293749999999989,70,5,{"$f":"M13+K13","v":52.293749999999989},"T50",false,null,false,null,{"$f":"(L13-60)/3*1.5","v":5},false]
[null,"Acura","NSX",1991,1992,2976,270,210,250,11.904,61.408000000000001,80,10,71.408000000000001,"T70",false,null,false,null,10,false]
[null,"Acura","NSX",1993,1997,3093,270,210,250,12.372,59.418999999999997,80,10,69.418999999999997,"T60",false,null,false,null,10,false]
[null,"Acura","NSX",1998,2001,3160,290,224,268,11.791044776119403,61.888059701492537,80,10,71.888059701492537,"T70",false,null,false,null,10,false]
[null,"Acura","NSX",2002,2005,2954,290,224,268,11.022388059701493,65.154850746268664,80,10,75.154850746268664,"T70",false,null,false,null,10,false]
[null,"Acura","NSX",2017,2022,3854,573,476,540.66666666666663,7.1282367447595565,81.704993834771884,105,22.5,104.20499383477188,"T100",false,null,false,null,22.5,false]
[null,"Acura","RSX Type S",2002,null,2767,200,142,180.66666666666663,15.315498154981553,46.9091328413284,60,0,46.9091328413284,"T40",false,null,false,null,0,false]
[null,"Alfa Romeo","2000 Spider Veloce",1974,1976,2320,110,110,110,21.09090909090909,22.363636363636374,45,-7.5,14.863636363636374,"T30",false,null,false,null,-7.5,false]
[null,"Alfa Romeo","Giulia 2.0T AWD",2017,null,3600,280,306,288.66666666666663,12.471131639722865,58.997690531177824,60,0,58.997690531177824,"T50",false,null,false,null,0,false]
[null,"Ariel","Atom",2006,2006,1431,245,150,213.33333333333331,6.7078125000000002,83.491796875000006,100,20,103.49179687500001,"T100",false,null,false,null,20,false]
[null,"Ariel","Atom 500",2008,null,1213,500,284,428,2.8341121495327104,99.955023364485982,100,20,119.95502336448598,"T110",false,null,false,null,20,false]
[null,"Aston Martin","DB5",1963,1965,3310,282,288,284,11.654929577464788,62.466549295774648,40,-10,52.466549295774648,"T50",false,null,false,null,-10,false]
[null,"Aston Martin","DBS V12",2007,2012,3740,510,420,480,7.791666666666667,78.885416666666657,80,10,88.885416666666657,"T80",false,null,false,null,10,false]
[null,"Aston Martin","Vantage",2012,null,3595,420,346,395.33333333333331,9.0935919055649244,73.352234401349079,80,10,83.352234401349079,"T80",false,null,false,null,10,false]
[null,"Audi","A4 1.8T Quattro",1996,2001,3241,150,155,151.66666666666666,21.369230769230771,21.180769230769215,60,0,21.180769230769215,"T30",false,null,false,null,0,false]
[null,"Audi","A4 2.0 T quattro",2005,2005,3517,200,207,202.33333333333331,17.382207578253709,38.125617792421735,60,0,38.125617792421735,"T30",false,null,false,null,0,false]
[null,"Audi","A4 2.0 T quattro",2006,2008,3549,200,207,202.33333333333331,17.540362438220761,37.453459637561764,60,0,37.453459637561764,"T30",false,null,false,null,0,false]
[null,"Audi","A4 2.8 Quattro",1996,2001,3384,190,207,195.66666666666666,17.294718909710394,38.497444633730822,60,0,38.497444633730822,"T30",false,null,false,null,0,false]
[null,"Audi","A4 3.0 Quattro",2002,2005,3583,220,221,220.33333333333331,16.261724659606656,42.887670196671706,60,0,42.887670196671706,"T40",false,null,false,null,0,false]
[null,"Audi","A4 3.2 quattro",2006,2006,3649,255,243,251,14.53784860557769,50.214143426294818,60,0,50.214143426294818,"T50",false,null,false,null,0,false]
[null,"Audi","A4 TT FWD",1998,2006,2910,180,173,177.66666666666666,16.378986866791745,42.389305816135078,60,0,42.389305816135078,"T40",false,null,false,null,0,false]
[null,"Audi","Coupe GT",1987,1987,2507,134,137,135,18.57037037037037,33.07592592592593,30,-15,18.07592592592593,"T30",false,null,false,null,-15,false]
[null,"Audi","R8 V10",2006,null,3583,518,391,475.66666666666663,7.5325858444288727,79.986510161177293,90,15,94.986510161177293,"T90",false,null,false,null,15,false]
[null,"Audi","R8 V8",2006,null,3450,414,317,381.66666666666663,9.039301310043669,73.5829694323144,90,15,88.5829694323144,"T80",false,null,false,null,15,false]
[null,"Audi","S4",1991,1994,3814,227,258,237.33333333333331,16.070224719101123,43.701544943820224,55,-2.5,41.201544943820224,"T40",false,null,false,null,-2.5,false]
[null,"Audi","S4",1998,2001,3594,250,258,252.66666666666666,14.224274406332455,51.546833773087066,65,2.5,54.046833773087066,"T50",false,null,false,null,2.5,false]
[null,"Audi","S4",2003,2005,3660,340,302,327.33333333333331,11.181262729124237,64.479633401222003,65,2.5,66.979633401222003,"T60",false,null,false,null,2.5,false]
[null,"Audi","S4",2006,2008,3869,340,302,327.33333333333331,11.819755600814664,61.766038696537677,65,2.5,64.266038696537677,"T60",false,null,false,null,2.5,false]
[null,"Audi","S4",2009,null,3637,333,325,330.33333333333331,11.010090817356206,65.207114026236127,70,5,70.207114026236127,"T70",false,null,false,null,5,false]
[null,"Audi","S6",1999,2003,4024,340,310,330,12.193939393939393,60.175757575757579,60,0,60.175757575757579,"T60",false,null,false,null,0,false]
[null,"Audi","S6",2006,2011,4024,429,398,418.66666666666663,9.6114649681528679,71.151273885350321,65,2.5,73.651273885350321,"T70",false,null,false,null,2.5,false]
[null,"Audi","S6 Quattro",1994,1997,3825,227,240,231.33333333333331,16.534582132564843,41.728025936599423,55,-2.5,39.228025936599423,"T30",false,null,false,null,-2.5,false]
[null,"Audi","TT RS",2012,2013,3307,360,343,354.33333333333331,9.3330197554092198,72.334666039510807,80,10,82.334666039510807,"T80",false,null,false,null,10,false]
[null,"Audi","TTS",2009,2015,3200,265,258,262.66666666666663,12.18274111675127,60.223350253807105,65,2.5,62.723350253807105,"T60",false,null,false,null,2.5,false]
[null,"Austin Healy","3000 MK III",1959,1967,2550,150,165,155,16.451612903225808,42.08064516129032,20,-20,22.08064516129032,"T30",false,null,false,null,-20,false]
[null,"BMW","M8 competition grand coupe ",2020,2023,4480,617,553,595.66666666666663,7.5209848908785677,80.035814213766088,80,10,90.035814213766088,"T90",false,null,false,null,10,false]
[null,"BMW",2002,1974,null,2317,100,106,101.99999999999999,22.715686274509807,15.458333333333314,30,-15,0.45833333333331439,"T30",false,null,false,null,-15,false]
[null,"BMW","128i",2008,2013,3252,230,200,219.99999999999997,14.781818181818183,49.177272727272722,68,4,53.177272727272722,"T50",false,null,false,null,4,false]
[null,"BMW","135i Coupe inc'l M-Sport",2004,2013,3373,300,300,300,11.243333333333334,64.215833333333336,70,5,69.215833333333336,"T60",false,null,false,null,5,false]
[null,"BMW","135is",2013,null,3373,320,317,319,10.573667711598747,67.061912225705328,75,7.5,74.561912225705328,"T70",false,null,false,null,7.5,false]
[null,"BMW","318i",1990,1991,2657,134,127,131.66666666666666,20.179746835443041,26.236075949367077,60,0,26.236075949367077,"T30",false,null,false,null,0,false]
[null,"BMW","318is",1990,1991,2602,134,127,131.66666666666666,19.762025316455698,28.011392405063276,60,0,28.011392405063276,"T30",false,null,false,null,0,false]
[null,"BMW","318ti",1993,2000,2745,140,129,136.33333333333331,20.134474327628364,26.42848410757945,60,0,26.42848410757945,"T30",false,null,false,null,0,false]
[null,"BMW","318ti with S52 swap",1991,1991,2602,240,236,238.66666666666666,10.902234636871508,65.665502793296099,60,0,65.665502793296099,"T60",false,null,false,null,0,false]
[null,"BMW","320i",2013,null,3295,180,184,181.33333333333331,18.170955882352942,34.7734375,70,5,39.7734375,"T30",false,null,false,null,5,false]
[null,"BMW","323ci",2000,null,3153,170,181,173.66666666666666,18.155470249520153,34.839251439539353,60,0,34.839251439539353,"T30",false,null,false,null,0,false]
[null,"BMW","325i",1991,1991,2854,168,164,166.66666666666666,17.124000000000002,39.222999999999985,60,0,39.222999999999985,"T30",false,null,false,null,0,false]
[null,"BMW","325i",1992,1995,3087,189,181,186.33333333333331,16.567084078711986,41.589892665474054,60,0,41.589892665474054,"T40",false,null,false,null,0,false]
[null,"BMW","325i",2001,2005,3241,184,175,181,17.906077348066297,35.899171270718242,60,0,35.899171270718242,"T30",false,null,false,null,0,false]
[null,"BMW","325is",1992,1995,3087,189,181,186.33333333333331,16.567084078711986,41.589892665474054,65,2.5,44.089892665474054,"T40",false,null,false,null,2.5,false]
[null,"BMW","328is",1996,1999,3120,190,206,195.33333333333331,15.97269624573379,44.116040955631391,65,2.5,46.616040955631391,"T40",false,null,false,null,2.5,false]
[null,"BMW","328iX",2012,2019,3498,240,255,245,14.277551020408163,51.320408163265306,70,5,56.320408163265306,"T50",false,null,false,null,5,false]
[null,"BMW","330Ci",2003,2003,3285,228,221,225.66666666666666,14.556868537666174,50.133308714918762,65,2.5,52.633308714918762,"T50",false,null,false,null,2.5,false]
[null,"BMW","330Ci ZHP",2003,2005,3285,235,222,230.66666666666666,14.241329479768787,51.474349710982658,70,5,56.474349710982658,"T50",false,null,false,null,5,false]
[null,"BMW","330i",2006,2006,3417,255,221,243.66666666666666,14.023255813953488,52.401162790697676,70,5,57.401162790697676,"T50",false,null,false,null,5,false]
[null,"BMW","330i Sports Package",2001,2005,3318,225,216,222,14.945945945945946,48.479729729729733,70,5,53.479729729729733,"T50",false,null,false,null,5,false]
[null,"BMW","335d RWD Sedan",2007,2011,3781,265,425,318.33333333333331,11.877486910994765,61.520680628272245,70,5,66.520680628272245,"T60",false,null,false,null,5,false]
[null,"BMW","335i RWD Coupe",2007,null,3571,300,300,300,11.903333333333334,61.410833333333329,70,5,66.410833333333329,"T60",false,null,false,null,5,false]
[null,"BMW","335i RWD Sedan",2006,2009,3594,300,300,300,11.98,61.085000000000001,70,5,66.085000000000008,"T60",false,null,false,null,5,false]
[null,"BMW","335xi",2008,2008,3814,300,295,298.33333333333331,12.784357541899443,57.666480446927366,70,5,62.666480446927366,"T60",false,null,false,null,5,false]
[null,"BMW","340XI",2017,null,3802,320,332,324,11.734567901234568,62.128086419753089,70,5,67.128086419753089,"T60",false,null,false,null,5,false]
[null,"BMW","528i",1995,2000,3252,190,210,196.66666666666666,16.535593220338985,41.723728813559319,65,2.5,44.223728813559319,"T40",false,null,false,null,2.5,false]
[null,"BMW","530i",2000,2003,3472,228,220,225.33333333333331,15.40828402366864,46.514792899408278,65,2.5,49.014792899408278,"T40",false,null,false,null,2.5,false]
[null,"BMW","535i",1985,1988,3249,182,214,{"$f":"G76*(2/3)+H76*(1/3)","v":192.66666666666666},{"$f":"F76/I76","v":16.863321799307958},{"$f":"J76*-4.25+112","v":40.330882352941174},40,{"$f":"(L76-60)/3*1.5","v":-10},30.330882352941174,{"$f":"INDEX(Base_Classes, MATCH($N76, Base_Assessments, 1)+1)","v":"T30"},{"$f":"OR(R76,A76)","v":false},null,false,null,-10,{"$f":"AND(P76,$S$9)","v":false}]
[null,"BMW","540i",1996,2003,3803,282,320,294.66666666666663,12.906108597285069,57.149038461538453,65,2.5,{"$f":"M77+K77","v":59.649038461538453},"T50",false,null,false,null,{"$f":"(L77-60)/3*1.5","v":2.5},false]
[null,"BMW","E30 M3",1987,1991,2866,192,170,184.66666666666666,15.51985559566787,46.040613718411549,70,5,51.040613718411549,"T50",false,null,false,null,5,false]
[null,"BMW","E36 M3  (3.0)",1995,1995,3175,240,225,235,13.51063829787234,54.579787234042556,81,10.5,65.079787234042556,"T60",false,null,false,null,10.5,false]
[null,"BMW","E36 M3 (3.2)",1997,1999,3175,240,236,238.66666666666666,13.303072625698325,55.461941340782118,81,10.5,65.961941340782118,"T60",false,null,false,null,10.5,false]
[null,"BMW","E46 M3",2001,2006,3415,333,269,311.66666666666663,10.9572192513369,65.431818181818173,80,10,75.431818181818173,"T70",false,null,false,null,10,false]
[null,"BMW","E90 M3",2007,2008,3704,414,295,374.33333333333331,9.8949243098842388,69.946571682991987,80,10,79.946571682991987,"T70",false,null,false,null,10,false]
[null,"BMW","F80 M3",2015,2018,3540,425,406,418.66666666666663,8.4554140127388546,76.06449044585986,90,15,91.06449044585986,"T90",false,null,false,null,15,false]
[null,"BMW","F82 M4 GTS coupe",2016,2020,3494,493,443,476.33333333333326,7.3351994401679512,80.825402379286203,90,15,95.825402379286203,"T90",false,null,false,null,15,false]
[null,"BMW","F82/83 M4 ",2015,2020,3530,425,406,418.66666666666663,8.4315286624203836,76.166003184713361,90,15,91.166003184713361,"T90",false,null,false,null,15,false]
[null,"BMW","F82/83 M4 Competition",2015,2020,3530,444,450,446,7.9147982062780269,78.362107623318394,100,20,98.362107623318394,"T90",false,null,false,null,20,false]
[null,"BMW","G82/83 M4 ",2021,null,3690,473,406,450.66666666666663,8.187869822485208,77.201553254437869,90,15,92.201553254437869,"T90",false,null,false,null,15,false]
[null,"BMW","G82/83 M4 Competition",2021,null,3746,503,479,495,7.567676767676768,79.837373737373738,100,20,99.837373737373738,"T90",false,null,false,null,20,false]
[null,"BMW","M Coupe",1998,2000,3131,240,236,238.66666666666666,13.118715083798882,56.245460893854748,70,5,61.245460893854748,"T60",false,null,false,null,5,false]
[null,"BMW","M Coupe",2001,2002,3131,315,261,297,10.542087542087542,67.196127946127945,70,5,72.196127946127945,"T70",false,null,false,null,5,false]
[null,"BMW","M Roadster",1998,2000,3084,240,236,238.66666666666666,12.921787709497208,57.082402234636866,65,2.5,59.582402234636866,"T50",false,null,false,null,2.5,false]
[null,"BMW","M Roadster",2001,2002,3084,315,261,297,10.383838383838384,67.868686868686865,65,2.5,70.368686868686865,"T70",false,null,false,null,2.5,false]
[null,"BMW","M2",2016,null,3455,365,343,357.66666666666663,9.6598322460391444,70.945712954333629,85,12.5,83.445712954333629,"T80",false,null,false,null,12.5,false]
[null,"BMW","M2 Competition",2019,2020,3472,405,406,405.33333333333331,8.5657894736842106,75.59539473684211,85,12.5,88.09539473684211,"T80",false,null,false,null,12.5,false]
[null,"BMW","M2 CS",2020,2020,3455,444,406,431.33333333333331,8.0100463678516238,77.957302936630597,90,15,92.957302936630597,"T90",false,null,false,null,15,false]
[null,"BMW","M235i",2016,null,3650,320,330,323.33333333333331,11.288659793814434,64.023195876288653,80,10,74.023195876288653,"T70",false,null,false,null,10,false]
[null,"BMW","M3 CSL",1995,1995,2950,240,225,235,12.553191489361701,58.648936170212771,81,10.5,69.148936170212778,"T60",false,null,false,null,10.5,false]
[null,"BMW","M5",1985,1988,3417,256,243,251.66666666666666,13.57748344370861,54.295695364238405,55,-2.5,51.795695364238405,"T50",false,null,false,null,-2.5,false]
[null,"BMW","M5",1989,1995,3858,311,266,296,13.033783783783784,56.606418918918919,60,0,56.606418918918919,"T50",false,null,false,null,0,false]
[null,"BMW","M5",1998,2003,4026,394,368,385.33333333333326,10.44809688581315,67.595588235294116,65,2.5,70.095588235294116,"T70",false,null,false,null,2.5,false]
[null,"BMW","M5",2005,2010,4090,500,380,460,8.8913043478260878,74.211956521739125,70,5,79.211956521739125,"T70",false,null,false,null,5,false]
[null,"BMW","M5",2011,null,4288,560,402,507.33333333333331,8.4520367936925105,76.07884362680683,70,5,81.07884362680683,"T80",false,null,false,null,5,false]
[null,"BMW","M6",1983,1989,3565,256,243,251.66666666666666,14.165562913907285,51.796357615894038,60,0,51.796357615894038,"T50",false,null,false,null,0,false]
[null,"BMW","M6",2005,2010,3770,500,380,460,8.195652173913043,77.168478260869563,70,5,82.168478260869563,"T80",false,null,false,null,5,false]
[null,"BMW","M6",2012,null,4242,560,402,507.33333333333331,8.3613666228646526,76.464191852825223,70,5,81.464191852825223,"T80",false,null,false,null,5,false]
[null,"BMW","Z3 1.9L",1996,1996,2690,138,133,136.33333333333331,19.731051344743278,28.143031784841071,60,0,28.143031784841071,"T30",false,null,false,null,0,false]
[null,"BMW","Z3 2.3L",2000,2000,2899,170,181,173.66666666666666,16.692898272552785,41.055182341650664,60,0,41.055182341650664,"T40",false,null,false,null,0,false]
[null,"BMW","Z3 2.8",2000,2000,2910,193,206,197.33333333333331,14.746621621621623,49.326858108108105,60,0,49.326858108108105,"T40",false,null,false,null,0,false]
[null,"BMW","Z4 3.0si",2006,2008,3086,255,220,243.33333333333331,12.682191780821919,58.100684931506848,70,5,63.100684931506848,"T60",false,null,false,null,5,false]
[null,"BMW","Z4 M Roadster",2006,2008,3197,330,262,307.33333333333331,10.402386117136659,67.789859002169194,75,7.5,75.289859002169194,"T70",false,null,false,null,7.5,false]
[null,"BMW","Z4 sDrive 30i 4 cyl turbo",2020,null,3287,255,295,268.33333333333331,12.249689440993789,59.938819875776396,85,12.5,72.438819875776403,"T70",false,null,false,null,12.5,false]
[null,"BMW","Z4 sDrive M40i 6 Cyl",2021,null,3457,382,369,377.66666666666663,9.153574580759047,73.097308031774048,85,12.5,85.597308031774048,"T80",false,null,false,null,12.5,false]
[null,"BMW","Z8",1999,2003,3494,400,370,389.99999999999994,8.9589743589743609,73.924358974358967,75,7.5,81.424358974358967,"T80",false,null,false,null,7.5,false]
[null,"Bugatti","Veyron",2005,2011,4162,987,922,965.33333333333326,4.3114640883977904,93.676277624309392,95,17.5,111.17627762430939,"T110",false,null,false,null,17.5,false]
[null,"Cadillac","ATS-V Coupe",2016,2017,3760,464,445,457.66666666666663,8.2155863073561548,77.083758193736344,90,15,92.083758193736344,"T90",false,null,false,null,15,false]
[null,"Cadillac","ATS-V Sedan V6",2016,2019,3803,335,285,318.33333333333331,11.946596858638744,61.22696335078534,90,15,76.22696335078534,"T70",false,null,false,null,15,false]
[null,"Cadillac","CTS-V",2004,2007,3850,400,395,398.33333333333326,9.6652719665271984,70.922594142259413,55,-2.5,68.422594142259413,"T60",false,null,false,null,-2.5,false]
[null,"Cadillac","CTS-V",2009,null,4250,556,551,554.33333333333326,7.6668671076368016,79.415814792543586,60,0,79.415814792543586,"T70",false,null,false,null,0,false]
[null,"Chevrolet","Camaro LS",2010,null,3750,312,278,300.66666666666663,12.47228381374723,58.992793791574272,65,2.5,61.492793791574272,"T60",false,null,false,null,2.5,false]
[null,"Chevrolet","Camaro RS",1994,1997,3473,200,225,208.33333333333331,16.670400000000001,41.150800000000004,60,0,41.150800000000004,"T40",false,null,false,null,0,false]
[null,"Chevrolet","Camaro RS",1998,2001,3349,190,225,201.66666666666666,16.606611570247935,41.421900826446276,65,2.5,43.921900826446276,"T40",false,null,false,null,2.5,false]
[null,"Chevrolet","Camaro SS",2010,null,3860,426,420,424,9.1037735849056602,73.308962264150949,65,2.5,75.808962264150949,"T70",false,null,false,null,2.5,false]
[null,"Chevrolet","Camaro SS",2018,null,3685,455,455,455,8.0989010989010985,77.579670329670336,75,7.5,85.079670329670336,"T80",false,null,false,null,7.5,false]
[null,"Chevrolet","Camaro SS 1LE",2017,null,3743,455,455,455,8.2263736263736256,77.03791208791209,90,15,92.03791208791209,"T90",false,null,false,null,15,false]
[null,"Chevrolet","Camaro SS L99 Automatic",2010,2013,3913,400,410,403.33333333333326,9.7016528925619845,70.767975206611567,65,2.5,73.267975206611567,"T70",false,null,false,null,2.5,false]
[null,"Chevrolet","Camaro Z28",1994,1997,3473,275,325,291.66666666666663,11.907428571428573,61.393428571428565,60,0,61.393428571428565,"T60",false,null,false,null,0,false]
[null,"Chevrolet","Camaro Z28",1998,2001,3459,284,322,296.66666666666663,11.659550561797754,62.446910112359546,65,2.5,64.946910112359546,"T60",false,null,false,null,2.5,false]
[null,"Chevrolet","Camaro Z28",2014,2015,3856,505,481,496.99999999999994,7.7585513078470836,79.026156941649901,75,7.5,86.526156941649901,"T80",false,null,false,null,7.5,false]
[null,"Chevrolet","Camaro ZL1",2017,null,3886,650,650,650,5.9784615384615387,86.591538461538462,80,10,96.591538461538462,"T90",false,null,false,null,10,false]
[null,"Chevrolet","Camaro ZL1",2012,2015,4118,580,556,572,7.1993006993006992,81.402972027972027,75,7.5,88.902972027972027,"T80",false,null,false,null,7.5,false]
[null,"Chevrolet","Camaro ZL1 1LE",2019,null,3886,650,650,650,5.9784615384615387,86.591538461538462,90,15,101.59153846153846,"T100",false,null,false,null,15,false]
[null,"Chevrolet","Corvette",1986,1986,3200,230,330,263.33333333333331,12.151898734177216,60.35443037974683,70,5,65.35443037974683,"T60",false,null,false,null,5,false]
[null,"Chevrolet","Corvette (C5) Coupe/Convertible",1997,2000,3230,345,350,346.66666666666663,9.3173076923076934,72.401442307692307,80,10,82.401442307692307,"T80",false,null,false,null,10,false]
[null,"Chevrolet","Corvette (C5) Coupe/Convertible",2001,2004,3230,350,360,353.33333333333331,9.1415094339622645,73.148584905660385,80,10,83.148584905660385,"T80",false,null,false,null,10,false]
[null,"Chevrolet","Corvette (C5) Z06",2001,2001,3130,385,385,384.99999999999994,8.129870129870131,77.44805194805194,90,15,92.44805194805194,"T90",false,null,false,null,15,false]
[null,"Chevrolet","Corvette (C5) Z06",2002,2004,3116,405,400,403.33333333333331,7.7256198347107441,79.166115702479345,80,10,89.166115702479345,"T80",false,null,false,null,10,false]
[null,"Chevrolet","Corvette (C6) Coupe Z06",2006,2007,3133,505,470,493.33333333333326,6.350675675675677,85.00962837837838,90,15,100.00962837837838,"T100",false,null,false,null,15,false]
[null,"Chevrolet","Corvette (C6) Coupe Z06",2008,2008,3161,506,470,494,6.3987854251012148,84.805161943319831,90,15,99.805161943319831,"T90",false,null,false,null,15,false]
[null,"Chevrolet","Corvette (C6) Coupe Z06",2009,2013,3199,506,470,494,6.4757085020242915,84.478238866396765,90,15,99.478238866396765,"T90",false,null,false,null,15,false]
[null,"Chevrolet","Corvette (C6) Coupe Z51",2005,2007,3179,400,400,{"$f":"G140*(2/3)+H140*(1/3)","v":399.99999999999994},{"$f":"F140/I140","v":7.9475000000000016},{"$f":"J140*-4.25+112","v":78.223124999999996},87,{"$f":"(L140-60)/3*1.5","v":13.5},91.723124999999996,{"$f":"INDEX(Base_Classes, MATCH($N140, Base_Assessments, 1)+1)","v":"T90"},{"$f":"OR(R140,A140)","v":false},null,false,null,13.5,{"$f":"AND(P140,$S$9)","v":false}]
[null,"Chevrolet","Corvette (C6) Coupe Z51",2008,2009,3216,430,424,427.99999999999994,7.5140186915887863,80.065420560747654,87,13.5,{"$f":"M141+K141","v":93.565420560747654},"T90",false,null,false,null,{"$f":"(L141-60)/3*1.5","v":13.5},false]
[null,"Chevrolet","Corvette (C6) Coupe/Convertible",2005,2007,3179,400,400,399.99999999999994,7.9475000000000016,78.223124999999996,85,12.5,90.723124999999996,"T90",false,null,false,null,12.5,false]
[null,"Chevrolet","Corvette (C6) Coupe/Convertible",2008,2013,3208,430,424,427.99999999999994,7.4953271028037394,80.144859813084111,85,12.5,92.644859813084111,"T90",false,null,false,null,12.5,false]
[null,"Chevrolet","Corvette (C6) Grand Sport Coupe",2010,2013,3289,430,424,427.99999999999994,7.6845794392523379,79.340537383177562,90,15,94.340537383177562,"T90",false,null,false,null,15,false]
[null,"Chevrolet","Corvette (C7) Coupe Z06",2014,2019,3550,625,635,628.33333333333326,5.6498673740053054,87.988063660477451,100,20,107.98806366047745,"T100",false,null,false,null,20,false]
[null,"Chevrolet","Corvette (C7) Coupe Z06 Aero pack",2014,2019,3550,625,635,628.33333333333326,5.6498673740053054,87.988063660477451,105,22.5,110.48806366047745,"T110",false,null,false,null,22.5,false]
[null,"Chevrolet","Corvette (C7) Coupe Z51",2014,2019,3444,460,460,459.99999999999994,7.4869565217391312,80.1804347826087,95,17.5,97.6804347826087,"T90",false,null,false,null,17.5,false]
[null,"Chevrolet","Corvette (C7) Coupe/Convertible",2014,2019,3347,455,460,456.66666666666663,7.329197080291971,80.850912408759115,90,15,95.850912408759115,"T90",false,null,false,null,15,false]
[null,"Chevrolet","Corvette (C7) Grand Sport",2017,2019,3445,460,465,461.66666666666663,7.4620938628158848,80.286101083032491,100,20,100.28610108303249,"T100",false,null,false,null,20,false]
[null,"Chevrolet","Corvette (C8)",2020,null,3640,490,465,481.66666666666663,7.5570934256055367,79.882352941176464,105,22.5,102.38235294117646,"T100",false,null,false,null,22.5,false]
[null,"Chevrolet","Corvette (C8) Z06",2023,null,3750,670,470,603.33333333333326,6.2154696132596694,85.584254143646405,115,27.5,113.0842541436464,"T110",false,null,false,null,27.5,false]
[null,"Chevrolet","Corvette (C8) Z51",2020,null,3640,490,465,481.66666666666663,7.5570934256055367,79.882352941176464,110,25,104.88235294117646,"T100",false,null,false,null,25,false]
[null,"Chevrolet","SS Sedan",2016,null,3946,415,415,414.99999999999994,9.5084337349397607,71.589156626506025,65,2.5,74.089156626506025,"T70",false,null,false,null,2.5,false]
[null,"Datsun","240Z",1973,1973,2355,150,146,148.66666666666666,15.840807174887894,44.676569506726452,55,-2.5,42.176569506726452,"T40",false,null,false,null,-2.5,false]
[null,"Datsun","280Z",1975,1978,2692,170,177,172.33333333333331,15.620889748549324,45.611218568665379,55,-2.5,43.111218568665379,"T40",false,null,false,null,-2.5,false]
[null,"Dodge","Challenger Hellcat",2015,null,4469,707,650,688,6.495639534883721,84.393531976744185,70,5,89.393531976744185,"T80",false,null,false,null,5,false]
[null,"Dodge","Challenger SRT8",2011,null,4170,470,470,470,8.8723404255319149,74.292553191489361,60,0,74.292553191489361,"T70",false,null,false,null,0,false]
[null,"Dodge","Neon ACR",1995,1999,2463,150,133,144.33333333333331,17.064665127020788,39.475173210161643,60,0,39.475173210161643,"T30",false,null,false,null,0,false]
[null,"Dodge","Neon Sport",2000,2005,2567,132,130,131.33333333333331,19.545685279187818,28.930837563451774,55,-2.5,26.430837563451774,"T30",false,null,false,null,-2.5,false]
[null,"Dodge","Neon Sport (SOHC)",1997,1997,2491,132,130,131.33333333333331,18.967005076142136,31.390228426395922,55,-2.5,28.890228426395922,"T30",false,null,false,null,-2.5,false]
[null,"Dodge","Neon SRT-4",2000,2005,2970,215,245,224.99999999999997,13.200000000000001,55.9,60,0,55.9,"T50",false,null,false,null,0,false]
[null,"Dodge","Shelby Charger Turbo",1987,1987,2500,175,175,175,14.285714285714286,51.285714285714285,30,-15,36.285714285714285,"T30",false,null,false,null,-15,false]
[null,"Dodge","Viper GTS",1996,2002,3383,450,490,463.33333333333331,7.3014388489208635,80.968884892086322,80,10,90.968884892086322,"T90",false,null,false,null,10,false]
[null,"Dodge","Viper GTS",2013,null,3431,640,560,613.33333333333326,5.5940217391304357,88.225407608695647,90,15,103.22540760869565,"T100",false,null,false,null,15,false]
[null,"Dodge","Viper RT/10",1992,1995,3284,400,465,421.66666666666663,7.7881422924901189,78.900395256916994,80,10,88.900395256916994,"T80",false,null,false,null,10,false]
[null,"Dodge","Viper SRT-10",2003,2006,3357,500,525,508.33333333333331,6.6039344262295083,83.933278688524581,85,12.5,96.433278688524581,"T90",false,null,false,null,12.5,false]
[null,"Dodge","Viper SRT-10",2008,2010,3408,600,560,586.66666666666663,5.8090909090909095,87.311363636363637,85,12.5,99.811363636363637,"T90",false,null,false,null,12.5,false]
[null,"Dodge ","Challenger Hellcat Redeye",2019,null,4443,797,707,766.99999999999989,5.7926988265971326,87.38102998696219,70,5,92.38102998696219,"T90",false,null,false,null,5,false]
[null,"Ferrari","250 GTO",1962,1964,2425,302,246,283.33333333333331,8.5588235294117645,75.625,50,-5,70.625,"T70",false,null,false,null,-5,false]
[null,"Ferrari","308 GTB/GTS",1977,1985,2778,240,209,229.66666666666666,12.09579100145138,60.592888243831638,65,2.5,63.092888243831638,"T60",false,null,false,null,2.5,false]
[null,"Ferrari","328 GTB/GTS",1985,1990,2806,270,225,255,11.003921568627451,65.233333333333334,70,5,70.233333333333334,"T70",false,null,false,null,5,false]
[null,"Ferrari","Enzo",2002,2004,3010,651,485,595.66666666666663,5.0531617235590378,90.524062674874088,105,22.5,113.02406267487409,"T110",false,null,false,null,22.5,false]
[null,"Ferrari","F355 Berlinetta",1994,1999,2976,380,286,348.66666666666663,8.5353728489483753,75.72466539196941,85,12.5,88.22466539196941,"T80",false,null,false,null,12.5,false]
[null,"Ferrari","F360 Modena",1999,2005,3197,400,275,358.33333333333326,8.9218604651162803,74.082093023255808,90,15,89.082093023255808,"T80",false,null,false,null,15,false]
[null,"Ferrari","F40",1987,1992,2400,478,425,460.33333333333326,5.2136133236784943,89.842143374366401,85,12.5,102.3421433743664,"T100",false,null,false,null,12.5,false]
[null,"Ferrari","F430",2004,2009,3197,483,343,436.33333333333331,7.3269671504965626,80.860389610389603,95,17.5,98.360389610389603,"T90",false,null,false,null,17.5,false]
[null,"Ferrari","F458 Italia",2010,null,3274,562,398,507.33333333333326,6.4533508541392912,84.573258869908017,95,17.5,102.07325886990802,"T100",false,null,false,null,17.5,false]
[null,"Fiat","500 Abarth",2008,null,2500,133,130,132,18.939393939393938,31.507575757575765,55,-2.5,29.007575757575765,"T30",false,null,false,null,-2.5,false]
[null,"Ford","Escort ZX2",1998,1998,2531,130,127,129,19.620155038759691,28.61434108527132,55,-2.5,26.11434108527132,"T30",false,null,false,null,-2.5,false]
[null,"Ford","Fiesta ST",2015,null,2742,197,202,198.66666666666663,13.802013422818794,53.341442953020128,60,0,53.341442953020128,"T50",false,null,false,null,0,false]
[null,"Ford","Focus Coupe",2008,2011,2588,140,136,138.66666666666666,18.66346153846154,32.680288461538453,55,-2.5,30.180288461538453,"T30",false,null,false,null,-2.5,false]
[null,"Ford","Focus RS",2016,null,3459,350,350,350,9.8828571428571426,69.997857142857143,85,12.5,82.497857142857143,"T80",false,null,false,null,12.5,false]
[null,"Ford","Focus SE",2000,2004,2546,100,125,108.33333333333331,23.501538461538466,12.118461538461517,55,-2.5,9.6184615384615171,"T30",false,null,false,null,-2.5,false]
[null,"Ford","Focus Sedan",2008,2011,2623,140,136,138.66666666666666,18.915865384615387,31.607572115384613,55,-2.5,29.107572115384613,"T30",false,null,false,null,-2.5,false]
[null,"Ford","Focus ST",2012,null,3223,252,270,258,12.492248062015504,58.907945736434108,70,5,63.907945736434108,"T60",false,null,false,null,5,false]
[null,"Ford","Focus SVT",2002,2004,2769,170,145,161.66666666666666,17.127835051546391,39.206701030927832,55,-2.5,36.706701030927832,"T30",false,null,false,null,-2.5,false]
[null,"Ford","Focus ZX3",2000,2004,2551,130,135,131.66666666666666,19.374683544303799,29.657594936708847,55,-2.5,27.157594936708847,"T30",false,null,false,null,-2.5,false]
[null,"Ford","Focus ZX4 S/SE/SES",2005,2007,2677,136,133,135,19.829629629629629,27.724074074074082,55,-2.5,25.224074074074082,"T30",false,null,false,null,-2.5,false]
[null,"Ford","Focus ZX4 ST",2005,2007,2677,151,154,152,17.611842105263158,37.149671052631575,60,0,37.149671052631575,"T30",false,null,false,null,0,false]
[null,"Ford","GT",2005,2006,3351,550,500,533.33333333333326,6.283125000000001,85.296718749999997,85,12.5,97.796718749999997,"T90",false,null,false,null,12.5,false]
[null,"Ford","Mustang",1964,1965,2562,271,312,284.66666666666663,9.0000000000000018,73.75,10,-25,48.75,"T40",false,null,false,null,-25,false]
[null,"Ford","Mustang Boss",2012,2013,3632,444,380,422.66666666666663,8.593059936908519,75.479495268138791,70,5,80.479495268138791,"T80",false,null,false,null,5,false]
[null,"Ford","Mustang Boss 302",1969,1970,3384,290,290,290,11.668965517241379,62.406896551724138,15,-22.5,39.906896551724138,"T30",false,null,false,null,-22.5,false]
[null,"Ford","Mustang Cobra",1996,1998,3404,305,300,303.33333333333331,11.221978021978023,64.306593406593407,50,-5,59.306593406593407,"T50",false,null,false,null,-5,false]
[null,"Ford","Mustang Cobra",1999,2001,3430,320,317,319,10.752351097178684,66.3025078369906,60,0,66.3025078369906,"T60",false,null,false,null,0,false]
[null,"Ford","Mustang Cobra",2003,2004,3665,390,390,390,9.3974358974358978,72.060897435897431,60,0,72.060897435897431,"T70",false,null,false,null,0,false]
[null,"Ford","Mustang Cobra GT-40",1994,1995,3524,240,285,255,13.819607843137256,53.266666666666666,50,-5,48.266666666666666,"T40",false,null,false,null,-5,false]
[null,"Ford","Mustang Cobra R",1995,1995,3354,280,343,301,11.142857142857142,64.642857142857139,50,-5,59.642857142857139,"T50",false,null,false,null,-5,false]
[null,"Ford","Mustang Cobra R",2000,2000,3589,385,385,384.99999999999994,9.3220779220779235,72.381168831168821,60,0,72.381168831168821,"T70",false,null,false,null,0,false]
[null,"Ford","Mustang GT",1994,1995,3276,215,285,238.33333333333331,13.745454545454546,53.581818181818178,45,-7.5,46.081818181818178,"T40",false,null,false,null,-7.5,false]
[null,"Ford","Mustang GT",1996,1997,3277,215,285,238.33333333333331,13.74965034965035,53.56398601398601,45,-7.5,46.06398601398601,"T40",false,null,false,null,-7.5,false]
[null,"Ford","Mustang GT",1998,2004,3324,260,302,274,12.131386861313869,60.441605839416056,50,-5,55.441605839416056,"T50",false,null,false,null,-5,false]
[null,"Ford","Mustang GT",2005,2009,3555,300,320,306.66666666666663,11.592391304347828,62.732336956521735,60,0,62.732336956521735,"T60",false,null,false,null,0,false]
[null,"Ford","Mustang GT",2010,2010,3533,315,325,{"$f":"G204*(2/3)+H204*(1/3)","v":318.33333333333331},{"$f":"F204/I204","v":11.098429319371728},{"$f":"J204*-4.25+112","v":64.831675392670149},60,{"$f":"(L204-60)/3*1.5","v":0},64.831675392670149,{"$f":"INDEX(Base_Classes, MATCH($N204, Base_Assessments, 1)+1)","v":"T60"},{"$f":"OR(R204,A204)","v":false},null,false,null,0,{"$f":"AND(P204,$S$9)","v":false}]
[null,"Ford","Mustang GT",2011,2014,3543,412,390,404.66666666666663,8.7553542009884691,74.789744645799004,60,0,{"$f":"M205+K205","v":74.789744645799004},"T70",false,null,false,null,{"$f":"(L205-60)/3*1.5","v":0},false]
[null,"Ford","Mustang GT",2015,2017,3705,435,400,423.33333333333331,8.7519685039370074,74.804133858267718,75,7.5,82.304133858267718,"T80",false,null,false,null,7.5,false]
[null,"Ford","Mustang GT",2018,null,3705,460,420,446.66666666666663,8.2947761194029859,76.7472014925373,75,7.5,84.2472014925373,"T80",false,null,false,null,7.5,false]
[null,"Ford","Mustang GT (Roush Stage 3)",2000,2001,3506,360,375,365,9.6054794520547944,71.176712328767124,60,0,71.176712328767124,"T70",false,null,false,null,0,false]
[null,"Ford","Mustang GT Performance Package 1",2018,null,3705,460,420,446.66666666666663,8.2947761194029859,76.7472014925373,80,10,86.7472014925373,"T80",false,null,false,null,10,false]
[null,"Ford","Mustang GT Performance Package 2",2018,null,3705,460,420,446.66666666666663,8.2947761194029859,76.7472014925373,85,12.5,89.2472014925373,"T80",false,null,false,null,12.5,false]
[null,"Ford","Mustang LX",1987,1993,3250,225,300,250,13,56.75,45,-7.5,49.25,"T40",false,null,false,null,-7.5,false]
[null,"Ford","Mustang Mach-1",2021,null,3829,480,420,460,8.3239130434782602,76.623369565217388,85,12.5,89.123369565217388,"T80",false,null,false,null,12.5,false]
[null,"Ford","Mustang SVO",1984,1986,3048,205,248,219.33333333333331,13.896656534954408,52.939209726443764,45,-7.5,45.439209726443764,"T40",false,null,false,null,-7.5,false]
[null,"Ford","Mustang SVT Cobra",1993,1993,3255,235,280,250,13.02,56.664999999999999,45,-7.5,49.164999999999999,"T40",false,null,false,null,-7.5,false]
[null,"Ford","Mustang V6",2005,2009,3350,210,240,220,15.227272727272727,47.284090909090907,55,-2.5,44.784090909090907,"T40",false,null,false,null,-2.5,false]
[null,"Ford","Mustang V6",2010,2010,3401,210,240,220,15.459090909090909,46.298863636363635,55,-2.5,43.798863636363635,"T40",false,null,false,null,-2.5,false]
[null,"Ford","Mustang V6",2011,null,3401,305,280,296.66666666666663,11.464044943820227,63.277808988764036,60,0,63.277808988764036,"T60",false,null,false,null,0,false]
[null,"Ford","Shelby GT",2007,2008,3475,325,330,326.66666666666663,10.637755102040817,66.789540816326536,60,0,66.789540816326536,"T60",false,null,false,null,0,false]
[null,"Ford","Shelby GT350 Base (non-Track Pack)",2016,2020,3796,526,429,493.66666666666663,7.6893990546927755,79.320054017555705,80,10,89.320054017555705,"T80",false,null,false,null,10,false]
[null,"Ford","Shelby GT350 Base (with Track Pack)",2016,2020,3796,526,429,493.66666666666663,7.6893990546927755,79.320054017555705,85,12.5,91.820054017555705,"T90",false,null,false,null,12.5,false]
[null,"Ford","Shelby GT350 R",2016,null,3718,526,429,493.66666666666663,7.5313977042538829,79.991559756920992,90,15,94.991559756920992,"T90",false,null,false,null,15,false]
[null,"Ford","Shelby GT500",2005,2009,3920,500,480,493.33333333333331,7.9459459459459465,78.229729729729726,70,5,83.229729729729726,"T80",false,null,false,null,5,false]
[null,"Ford","Shelby GT500",2010,2010,3940,540,510,530,7.4339622641509431,80.405660377358487,65,2.5,82.905660377358487,"T80",false,null,false,null,2.5,false]
[null,"Ford","Shelby GT500",2011,2012,3871,550,510,536.66666666666663,7.2130434782608699,81.344565217391306,70,5,86.344565217391306,"T80",false,null,false,null,5,false]
[null,"Ford","Shelby GT500",2013,2014,3871,662,630,651.33333333333326,5.9431934493346992,86.741427840327532,70,5,91.741427840327532,"T90",false,null,false,null,5,false]
[null,"Ford","Shelby GT500",2020,null,4059,760,625,715,5.6769230769230772,87.873076923076923,75,7.5,95.373076923076923,"T90",false,null,false,null,7.5,false]
[null,"Ford","Shelby Mustang GT350 Convertible",1969,1970,3600,290,385,321.66666666666663,11.191709844559586,64.435233160621749,15,-22.5,41.935233160621749,"T40",false,null,false,null,-22.5,false]
[null,"Ford","Shelby Mustang GT500",1967,1967,3370,355,420,376.66666666666663,8.946902654867257,73.975663716814154,15,-22.5,51.475663716814154,"T50",false,null,false,null,-22.5,false]
[null,"Honda","Accord ",1994,1994,3076,130,139,133,23.127819548872182,13.706766917293223,50,-5,8.7067669172932227,"T30",false,null,false,null,-5,false]
[null,"Honda","Civic 3dr non-Si",1992,1992,2178,102,98,100.66666666666666,21.635761589403977,20.048013245033104,50,-5,15.048013245033104,"T30",false,null,false,null,-5,false]
[null,"Honda","Civic CX",1991,1995,2094,70,91,77,27.194805194805195,-3.5779220779220822,50,-5,-8.5779220779220822,"T30",false,null,false,null,-5,false]
[null,"Honda","Civic Cx w/ K24A swap",1991,1995,2094,197,171,188.33333333333331,11.11858407079646,64.746017699115043,50,-5,59.746017699115043,"T50",false,null,false,null,-5,false]
[null,"Honda","Civic DX",1995,1995,2231,102,98,100.66666666666666,22.162251655629142,17.810430463576154,50,-5,12.810430463576154,"T30",false,null,false,null,-5,false]
[null,"Honda","Civic DX",1996,1996,2262,127,107,120.33333333333331,18.797783933518009,32.109418282548461,50,-5,27.109418282548461,"T30",false,null,false,null,-5,false]
[null,"Honda","Civic DX",1998,1998,2339,106,103,104.99999999999999,22.276190476190479,17.326190476190462,50,-5,12.326190476190462,"T30",false,null,false,null,-5,false]
[null,"Honda","Civic DX",2003,2003,2416,115,110,113.33333333333331,21.317647058823532,21.399999999999991,50,-5,16.399999999999991,"T30",false,null,false,null,-5,false]
[null,"Honda","Civic DX Coupe",2006,2006,2593,140,128,136,19.066176470588236,30.96875,55,-2.5,28.46875,"T30",false,null,false,null,-2.5,false]
[null,"Honda","Civic Hatchback",1988,1991,2127,70,89,76.333333333333329,27.8646288209607,-6.4246724890829796,50,-5,-11.42467248908298,"T30",false,null,false,null,-5,false]
[null,"Honda","Civic Hatchback DX",1990,1991,2127,92,89,91,23.373626373626372,12.662087912087912,50,-5,7.6620879120879124,"T30",false,null,false,null,-5,false]
[null,"Honda","Civic Si",1992,null,2326,125,106,118.66666666666666,19.601123595505619,28.69522471910112,55,-2.5,26.19522471910112,"T30",false,null,false,null,-2.5,false]
[null,"Honda","Civic Si",2006,2011,2899,192,139,174.33333333333331,16.629063097514344,41.326481835564039,65,2.5,43.826481835564039,"T40",false,null,false,null,2.5,false]
[null,"Honda","Civic Si",2012," ",2895,201,170,190.66666666666666,15.183566433566435,47.469842657342653,65,2.5,49.969842657342653,"T50",false,null,false,null,2.5,false]
[null,"Honda","Civic Type R",2017,null,3150,306,295,302.33333333333331,10.41896361631753,67.719404630650502,85,12.5,80.219404630650502,"T80",false,null,false,null,12.5,false]
[null,"Honda","CRS Si",1987,1987,1953,91,93,91.666666666666657,21.305454545454548,21.451818181818169,55,-2.5,18.951818181818169,"T30",false,null,false,null,-2.5,false]
[null,"Honda","CRX Si",1985,1986,1883,108,100,105.33333333333333,17.876582278481013,36.024525316455694,55,-2.5,33.524525316455694,"T30",false,null,false,null,-2.5,false]
[null,"Honda","CRX Si",1988,1988,2011,108,100,105.33333333333333,19.091772151898734,30.859968354430379,55,-2.5,28.359968354430379,"T30",false,null,false,null,-2.5,false]
[null,"Honda","S2000",1999,2003,2870,240,153,211,13.601895734597157,54.191943127962084,75,7.5,61.691943127962084,"T60",false,null,false,null,7.5,false]
[null,"Honda","S2000 2.2L",2004,2009,2870,237,162,212,13.537735849056604,54.464622641509429,80,10,64.464622641509436,"T60",false,null,false,null,10,false]
[null,"Honda","S2000 CR",2008,2009,2765,237,162,212,13.04245283018868,56.569575471698116,85,12.5,69.069575471698116,"T60",false,null,false,null,12.5,false]
[null,"Hyundai","Genesis Coupe",2010,2011,3315,210,217,212.33333333333331,15.612244897959185,45.647959183673464,75,7.5,53.147959183673464,"T50",false,null,false,null,7.5,false]
[null,"Hyundai","Genesis coupe R Spec 2.0T",2010,2012,3300,210,235,218.33333333333331,15.114503816793894,47.763358778625957,70,5,52.763358778625957,"T50",false,null,false,null,5,false]
[null,"Hyundai","Genesis coupe R Spec 2.0T",2013,2015,3300,275,275,275,12,61,70,5,66,"T60",false,null,false,null,5,false]
[null,"Hyundai","Genesis coupe R Spec 3.8",2013,2016,3389,348,295,330.33333333333331,10.259334006054491,68.397830474268403,70,5,73.397830474268403,"T70",false,null,false,null,5,false]
[null,"Hyundai","Genesis Coupe R Spec 3.8",2011,2012,3389,306,266,292.66666666666663,11.579726651480639,62.786161731207287,80,10,72.786161731207287,"T70",false,null,false,null,10,false]
[null,"Hyundai","Veloster N",2019,null,3036,250,260,253.33333333333331,11.98421052631579,61.067105263157892,70,5,66.067105263157885,"T60",false,null,false,null,5,false]
[null,"Hyundai","Veloster N w/pref package",2019,null,3036,275,260,270,11.244444444444444,64.211111111111109,75,7.5,71.711111111111109,"T70",false,null,false,null,7.5,false]
[null,"Infiniti","G35 Coupe",2003,2006,3420,280,269,276.33333333333331,12.376357056694815,59.400482509047038,65,2.5,61.900482509047038,"T60",false,null,false,null,2.5,false]
[null,"Jaguar","F Type S Coupe",2015,2016,3514,380,339,366.33333333333331,9.5923566878980893,71.232484076433124,75,7.5,78.732484076433124,"T70",false,null,false,null,7.5,false]
[null,"Jaguar","X Type sportwagon",2005,2005,3747,227,206,219.99999999999997,17.031818181818185,39.614772727272708,60,0,39.614772727272708,"T30",false,null,false,null,0,false]
[null,"Jaguar","XKR",2003,2006,3785,390,399,393,9.6310432569974562,71.068066157760811,65,2.5,73.568066157760811,"T70",false,null,false,null,2.5,false]
[null,"Jaguar","XKR-S",2006,null,3968,550,502,534,7.4307116104868918,80.419475655430716,70,5,85.419475655430716,"T80",false,null,false,null,5,false]
[null,"Lamborghini","Aventador",2011,null,3470,690,510,630,5.5079365079365079,88.591269841269849,90,15,103.59126984126985,"T100",false,null,false,null,15,false]
[null,"Lamborghini","Gallardo LP 560-4",2012,null,3109,552,398,500.66666666666663,6.2097203728362187,85.608688415446068,90,15,100.60868841544607,"T100",false,null,false,null,15,false]
[null,"Lamborghini","Murcielago LP 670-4",2009,2010,3671,661,490,604,6.0778145695364234,86.169288079470192,90,15,101.16928807947019,"T100",false,null,false,null,15,false]
[null,"Lexus","IS300",2001,2005,3255,215,218,215.99999999999997,15.069444444444446,47.9548611111111,60,0,47.9548611111111,"T40",false,null,false,null,0,false]
[null,"Lexus","LFA",2011,2012,3263,552,354,486,6.7139917695473255,83.465534979423865,85,12.5,95.965534979423865,"T90",false,null,false,null,12.5,false]
[null,"Lotus","Elise",2005,2007,2006,190,138,172.66666666666666,11.617760617760618,62.624517374517374,75,7.5,70.124517374517382,"T70",false,null,false,null,7.5,false]
[null,"Lotus","Esprit",1996,1998,3043,350,295,{"$f":"G268*(2/3)+H268*(1/3)","v":331.66666666666663},{"$f":"F268/I268","v":9.174874371859298},{"$f":"J268*-4.25+112","v":73.006783919597979},70,{"$f":"(L268-60)/3*1.5","v":5},78.006783919597979,{"$f":"INDEX(Base_Classes, MATCH($N268, Base_Assessments, 1)+1)","v":"T70"},{"$f":"OR(R268,A268)","v":false},null,false,null,5,{"$f":"AND(P268,$S$9)","v":false}]
[null,"Maserati","Gran Turismo S",2008,2012,4100,434,360,409.33333333333331,10.016286644951141,69.43078175895765,80,10,{"$f":"M269+K269","v":79.43078175895765},"T70",false,null,false,null,{"$f":"(L269-60)/3*1.5","v":10},false]
[null,"Mazda",3,2012,null,2866,148,135,143.66666666666666,19.94895591647332,27.216937354988389,55,-2.5,24.716937354988389,"T30",false,null,false,null,-2.5,false]
[null,"Mazda","MazdaSpeed MX5",2004,2005,2529,178,166,174,14.53448275862069,50.228448275862064,70,5,55.228448275862064,"T50",false,null,false,null,5,false]
[null,"Mazda","Mazdaspeed Protege",2003,2003,2843,170,160,166.66666666666666,17.058,39.503500000000003,60,0,39.503500000000003,"T30",false,null,false,null,0,false]
[null,"Mazda","Mazdaspeed3",2007,2007,3153,263,280,268.66666666666663,11.73573200992556,62.123138957816373,60,0,62.123138957816373,"T60",false,null,false,null,0,false]
[null,"Mazda","Mazdaspeed6",2006,2007,3589,274,280,276,13.003623188405797,56.73460144927536,60,0,56.73460144927536,"T50",false,null,false,null,0,false]
[null,"Mazda","Miata NA 1.6",1989,1993,2222,116,100,110.66666666666666,20.078313253012048,26.6671686746988,65,2.5,29.1671686746988,"T30",false,null,false,null,2.5,false]
[null,"Mazda","Miata NA 1.8",1994,1997,2293,128,114,123.33333333333333,18.591891891891894,32.984459459459444,65,2.5,35.484459459459444,"T30",false,null,false,null,2.5,false]
[null,"Mazda","Miata NB",1999,2005,2447,140,125,135,18.125925925925927,34.964814814814815,65,2.5,37.464814814814815,"T30",false,null,false,null,2.5,false]
[null,"Mazda","MX-5 NC",2006,2015,2525,170,140,160,15.78125,44.9296875,70,5,49.9296875,"T40",false,null,false,null,5,false]
[null,"Mazda","MX-5 ND",2016,2018,2332,155,148,152.66666666666666,15.275109170305678,47.080786026200869,75,7.5,54.580786026200869,"T50",false,null,false,null,7.5,false]
[null,"Mazda","MX-5 ND",2019,null,2318,181,151,171,13.555555555555555,54.388888888888893,75,7.5,61.888888888888893,"T60",false,null,false,null,7.5,false]
[null,"Mazda","RX7",1981,1983,2350,101,107,103,22.815533980582526,15.033980582524265,50,-5,10.033980582524265,"T30",false,null,false,null,-5,false]
[null,"Mazda","RX-7",1986,1988,2700,146,138,143.33333333333331,18.837209302325583,31.941860465116278,60,0,31.941860465116278,"T30",false,null,false,null,0,false]
[null,"Mazda","RX-7 (non-turbo)",1989,1991,2787,160,140,153.33333333333331,18.17608695652174,34.751630434782612,60,0,34.751630434782612,"T30",false,null,false,null,0,false]
[null,"Mazda","RX-7 Turbo",1986,1988,2850,182,183,182.33333333333331,15.630712979890312,45.56946983546618,60,0,45.56946983546618,"T40",false,null,false,null,0,false]
[null,"Mazda","RX-7 Turbo",1993,1995,2858,255,217,242.33333333333331,11.793672627235214,61.876891334250338,75,7.5,69.376891334250331,"T60",false,null,false,null,7.5,false]
[null,"Mazda","RX-8",2003,2008,3051,238,159,211.66666666666666,14.414173228346458,50.73976377952755,70,5,55.73976377952755,"T50",false,null,false,null,5,false]
[null,"Mazda","RX-8",2009,2011,3065,232,159,207.66666666666666,14.759229534510434,49.273274478330656,75,7.5,56.773274478330656,"T50",false,null,false,null,7.5,false]
[null,"Mazda ","MX-5 NC (Factory Automatic)",2006,2006,2527,166,140,157.33333333333331,16.061440677966104,43.738877118644055,70,5,48.738877118644055,"T40",false,null,false,null,5,false]
[null,"Mercedes","190E",1990,1993,2987,130,146,135.33333333333331,22.071428571428573,18.196428571428569,60,0,18.196428571428569,"T30",false,null,false,null,0,false]
[null,"Mercedes","GTR Pro",2020,null,3650,577,516,556.66666666666663,6.5568862275449105,84.133233532934128,115,27.5,111.63323353293413,"T110",false,null,false,null,27.5,false]
[null,"Mercedes Benz","e500 Wagon",2006,2006,4231,302,339,314.33333333333331,13.460233297985155,54.79400848356309,60,0,54.79400848356309,"T50",false,null,false,null,0,false]
[null,"Mercedes-Benz","CLK 55 AMG",2002,2002,3500,345,376,355.33333333333331,9.8499061913696071,70.137898686679165,70,5,75.137898686679165,"T70",false,null,false,null,5,false]
[null,"Mercedes-Benz","SLS AMG",2011,null,3600,363,480,402,8.9552238805970141,73.9402985074627,85,12.5,86.4402985074627,"T80",false,null,false,null,12.5,false]
[null,"MG","Midget",1971,1971,1701,54,67,58.333333333333329,29.160000000000004,-11.930000000000021,45,-7.5,-19.430000000000021,"T30",false,null,false,null,-7.5,false]
[null,"MINI","Cooper",2001,2006,2519,115,111,113.66666666666666,22.161290322580648,17.814516129032242,65,2.5,20.314516129032242,"T30",false,null,false,null,2.5,false]
[null,"MINI","Cooper",2006,null,2568,118,114,116.66666666666666,22.011428571428574,18.451428571428565,65,2.5,20.951428571428565,"T30",false,null,false,null,2.5,false]
[null,"MINI","Cooper S",2005,2005,2678,168,162,166,16.132530120481928,43.436746987951807,70,5,48.436746987951807,"T40",false,null,false,null,5,false]
[null,"MINI","Cooper S",2006,null,2679,172,177,173.66666666666666,15.426103646833015,46.439059500959686,70,5,51.439059500959686,"T50",false,null,false,null,5,false]
[null,"Mini","Cooper S JCW",2004,null,2678,200,177,192.33333333333331,13.923743500866552,52.824090121317155,70,5,57.824090121317155,"T50",false,null,false,null,5,false]
[null,"Mini","JCW GP",2013,2013,2624,211,207,209.66666666666666,12.51510333863275,58.810810810810814,80,10,68.810810810810807,"T60",false,null,false,null,10,false]
[null,"Mitsubishi","Eclipse GST",1995,1999,2767,210,214,211.33333333333331,13.093059936908519,56.354495268138791,50,-5,51.354495268138791,"T50",false,null,false,null,-5,false]
[null,"Mitsubishi","Eclipse GSX",1995,1999,3157,210,214,211.33333333333331,14.938485804416406,48.511435331230274,65,2.5,51.011435331230274,"T50",false,null,false,null,2.5,false]
[null,"Mitsubishi","Eclipse GT",2000,2005,3053,200,205,201.66666666666663,15.138842975206614,47.659917355371888,55,-2.5,45.159917355371888,"T40",false,null,false,null,-2.5,false]
[null,"Mitsubishi","Eclipse GT-6",2006,2006,3472,263,260,262,13.251908396946565,55.679389312977101,55,-2.5,53.179389312977101,"T50",false,null,false,null,-2.5,false]
[null,"Mitsubishi","Galant VR4",1992,1996,3200,237,228,234,13.675213675213675,53.880341880341881,50,-5,48.880341880341881,"T40",false,null,false,null,-5,false]
[null,"Mitsubishi","Galant VR4",1996,2003,3400,276,271,274.33333333333331,12.393681652490887,59.326852976913727,55,-2.5,56.826852976913727,"T50",false,null,false,null,-2.5,false]
[null,"Mitsubishi","Lancer Evo I",1992,1993,2730,244,228,238.66666666666666,11.438547486033521,63.386173184357538,65,2.5,65.886173184357546,"T60",false,null,false,null,2.5,false]
[null,"Mitsubishi","Lancer Evo II",1994,1995,2756,260,228,249.33333333333331,11.053475935828878,65.022727272727266,70,5,70.022727272727266,"T70",false,null,false,null,5,false]
[null,"Mitsubishi","Lancer Evo IX",2005,2007,3285,286,289,287,11.445993031358885,63.35452961672474,80,10,73.354529616724733,"T70",false,null,false,null,10,false]
[null,"Mitsubishi","Lancer Evo VII",2001,2003,3086,280,283,281,10.982206405693951,65.32562277580071,75,7.5,72.82562277580071,"T70",false,null,false,null,7.5,false]
[null,"Mitsubishi","Lancer Evo VIII",2003,2005,3241,271,273,271.66666666666663,11.930061349693252,61.297239263803675,80,10,71.297239263803675,"T70",false,null,false,null,10,false]
[null,"Mitsubishi","Lander Evo X",2008,null,3527,295,311,300.33333333333331,11.743618201997782,62.089622641509429,85,12.5,74.589622641509436,"T70",false,null,false,null,12.5,false]
[null,"Nissan","200SX SE",1995,1995,2366,115,108,112.66666666666666,21,22.75,45,-7.5,15.25,"T30",false,null,false,null,-7.5,false]
[null,"Nissan","200SX SE",1996,1997,2348,115,108,112.66666666666666,20.840236686390533,23.428994082840234,45,-7.5,15.928994082840234,"T30",false,null,false,null,-7.5,false]
[null,"Nissan","200SX SE",1998,1998,2418,115,108,112.66666666666666,21.461538461538463,20.788461538461533,45,-7.5,13.288461538461533,"T30",false,null,false,null,-7.5,false]
[null,"Nissan","200SX SE-R",1995,1995,2535,140,132,137.33333333333331,18.458737864077673,33.550364077669897,50,-5,28.550364077669897,"T30",false,null,false,null,-5,false]
[null,"Nissan","200SX SE-R",1996,1997,2491,140,132,137.33333333333331,18.13834951456311,34.91201456310678,50,-5,29.91201456310678,"T30",false,null,false,null,-5,false]
[null,"Nissan","200SX SE-R",1998,1998,2586,140,132,137.33333333333331,18.830097087378643,31.972087378640765,50,-5,26.972087378640765,"T30",false,null,false,null,-5,false]
[null,"Nissan","240SX",1989,1994,2698,155,160,156.66666666666666,17.221276595744683,38.809574468085088,55,-2.5,36.309574468085088,"T30",false,null,false,null,-2.5,false]
[null,"Nissan","240SX",1995,1999,2762,155,160,156.66666666666666,17.629787234042553,37.073404255319147,60,0,37.073404255319147,"T30",false,null,false,null,0,false]
[null,"Nissan","350Z",2003,2005,3247,287,274,282.66666666666663,11.487028301886793,63.180129716981128,75,7.5,70.680129716981128,"T70",false,null,false,null,7.5,false]
[null,"Nissan","350Z",2006,2006,3339,300,260,286.66666666666663,11.647674418604653,62.497383720930223,75,7.5,69.99738372093023,"T70",false,null,false,null,7.5,false]
[null,"Nissan","350Z Nismo",2007,2008,3353,306,268,293.33333333333331,11.430681818181819,63.419602272727268,75,7.5,70.919602272727275,"T70",false,null,false,null,7.5,false]
[null,"Nissan","370Z Coupe",2009,2011,3272,332,270,311.33333333333331,10.50963597430407,67.334047109207702,75,7.5,74.834047109207702,"T70",false,null,false,null,7.5,false]
[null,"Nissan","370Z Nismo",2009,2014,3340,350,276,325.33333333333331,10.266393442622951,68.367827868852459,75,7.5,75.867827868852459,"T70",false,null,false,null,7.5,false]
[null,"Nissan","400Z",2023,null,3400,400,350,383.33333333333326,8.8695652173913064,74.304347826086939,80,10,84.304347826086939,"T80",false,null,false,null,10,false]
[null,"Nissan","GT-R",2007,2010,3800,480,433,464.33333333333331,8.1837760229720029,77.218951902368985,111,25.5,102.71895190236899,"T100",false,null,false,null,25.5,false]
[null,"Nissan","GT-R",2007,2010,3800,478,434,463.33333333333326,8.2014388489208638,77.143884892086334,105,22.5,99.643884892086334,"T90",false,null,false,null,22.5,false]
[null,"Nissan","GT-R",2011,2012,3829,530,448,502.66666666666663,7.6173740053050407,79.626160477453567,111,25.5,105.12616047745357,"T100",false,null,false,null,25.5,false]
[null,"Nissan","GT-R",2013,2019,3829,545,463,517.66666666666663,7.3966516419832589,80.564230521571147,111,25.5,106.06423052157115,"T100",false,null,false,null,25.5,false]
[null,"Nissan","GT-R NISMO",2015,2019,3851,595,481,557,6.9138240574506282,82.616247755834834,117,28.5,111.11624775583483,"T110",false,null,false,null,28.5,false]
[null,"Nissan","Juke",2011,null,2912,188,177,{"$f":"G332*(2/3)+H332*(1/3)","v":184.33333333333331},{"$f":"F332/I332","v":15.797468354430382},{"$f":"J332*-4.25+112","v":44.860759493670869},50,{"$f":"(L332-60)/3*1.5","v":-5},39.860759493670869,{"$f":"INDEX(Base_Classes, MATCH($N332, Base_Assessments, 1)+1)","v":"T30"},{"$f":"OR(R332,A332)","v":false},null,false,null,-5,{"$f":"AND(P332,$S$9)","v":false}]
[null,"Nissan","Sentra SE",2000,2006,2544,145,136,142,17.91549295774648,35.859154929577457,45,-7.5,{"$f":"M333+K333","v":28.359154929577457},"T30",false,null,false,null,{"$f":"(L333-60)/3*1.5","v":-7.5},false]
[null,"Nissan","Sentra SE-R",1991,1994,2469,138,132,136,18.154411764705884,34.84375,50,-5,29.84375,"T30",false,null,false,null,-5,false]
[null,"Nissan","Sentra SE-R",2000,2006,2746,165,175,168.33333333333331,16.312871287128715,42.670297029702965,60,0,42.670297029702965,"T40",false,null,false,null,0,false]
[null,"Nissan","Sentra XE",1991,1994,2386,115,108,112.66666666666666,21.177514792899409,21.995562130177518,45,-7.5,14.495562130177518,"T30",false,null,false,null,-7.5,false]
[null,"Nissan","Skyline GT-R (R32)",1989,1991,3152,276,266,272.66666666666663,11.559902200488999,62.870415647921753,70,5,67.87041564792176,"T60",false,null,false,null,5,false]
[null,"Nissan","Skyline GT-R (R33)",1993,1998,3373,276,266,272.66666666666663,12.370415647921762,59.425733496332512,75,7.5,66.925733496332512,"T60",false,null,false,null,7.5,false]
[null,"Nissan","Skyline GT-R (R34)",1999,2002,3386,276,266,272.66666666666663,12.418092909535455,59.223105134474316,85,12.5,71.723105134474309,"T70",false,null,false,null,12.5,false]
[null,"Pontiac","Fiero GT",1988,1988,2790,135,160,143.33333333333331,19.465116279069768,29.273255813953483,50,-5,24.273255813953483,"T30",false,null,false,null,-5,false]
[null,"Pontiac","Firebird TransAm",1996,1996,3477,305,335,315,11.038095238095238,65.088095238095235,60,0,65.088095238095235,"T60",false,null,false,null,0,false]
[null,"Pontiac","Firebird TransAm",2002,2002,3396,310,340,320,10.612500000000001,66.896874999999994,65,2.5,69.396874999999994,"T60",false,null,false,null,2.5,false]
[null,"Pontiac","Firebird TransAm TTA",1989,1989,3400,250,340,280,12.142857142857142,60.392857142857146,50,-5,55.392857142857146,"T50",false,null,false,null,-5,false]
[null,"Pontiac","GTO",2004,2004,3725,350,365,355,10.492957746478874,67.404929577464785,60,0,67.404929577464785,"T60",false,null,false,null,0,false]
[null,"Pontiac","GTO",2005,2006,3725,400,400,399.99999999999994,9.3125000000000018,72.421875,60,0,72.421875,"T70",false,null,false,null,0,false]
[null,"Pontiac","Solstice (also Saturn Sky)",2006,2010,2877,177,166,173.33333333333331,16.598076923076924,41.458173076923075,70,5,46.458173076923075,"T40",false,null,false,null,5,false]
[null,"Pontiac","Solstice GXP (Saturn Redline)",2007,2010,3031,260,260,260,11.657692307692308,62.454807692307689,70,5,67.454807692307696,"T60",false,null,false,null,5,false]
[null,"Porsche",912,1967,1967,2315,86,98,90,25.722222222222221,2.6805555555555571,40,-10,-7.3194444444444429,"T30",false,null,false,null,-10,false]
[null,"Porsche",944,1982,1987,2790,143,137,141,19.787234042553191,27.904255319148945,65,2.5,30.404255319148945,"T30",false,null,false,null,2.5,false]
[null,"Porsche","911 (964)",1989,1994,3031,247,228,240.66666666666666,12.594182825484765,58.474722991689745,70,5,63.474722991689745,"T60",false,null,false,null,5,false]
[null,"Porsche","911 (993)",1995,1998,3020,272,243,262.33333333333331,11.512071156289709,63.073697585768734,75,7.5,70.573697585768741,"T70",false,null,false,null,7.5,false]
[null,"Porsche","911 3.2L",1986,1989,2756,214,195,207.66666666666666,13.271268057784912,55.597110754414125,65,2.5,58.097110754414125,"T50",false,null,false,null,2.5,false]
[null,"Porsche","911 Carrera (996)",1999,1999,2910,296,258,283.33333333333331,10.270588235294118,68.349999999999994,80,10,78.349999999999994,"T70",false,null,false,null,10,false]
[null,"Porsche","911 Carrera 2 (996)",2002,2002,3098,320,273,304.33333333333331,10.179627601314349,68.736582694414011,80,10,78.736582694414011,"T70",false,null,false,null,10,false]
[null,"Porsche","911 Carrera 3.6L (996)",2005,2005,3075,325,273,307.66666666666663,9.9945828819068261,69.523022751895979,80,10,79.523022751895979,"T70",false,null,false,null,10,false]
[null,"Porsche","911 Carrera C4S",2020,null,3373,443,390,425.33333333333331,7.9302507836990603,78.296434169278996,115,27.5,105.796434169279,"T100",false,null,false,null,27.5,false]
[null,"Porsche","911 Carrera S",2012.5,null,3075,400,325,374.99999999999994,8.2000000000000011,77.150000000000006,85,12.5,89.65,"T80",false,null,false,null,12.5,false]
[null,"Porsche","911 Carrera S (997)",2009,2009,3150,385,310,359.99999999999994,8.7500000000000018,74.8125,80,10,84.8125,"T80",false,null,false,null,10,false]
[null,"Porsche","911 Carrera S 3.8L (996)",2005,2005,3131,355,295,335,9.3462686567164184,72.278358208955225,80,10,82.278358208955225,"T80",false,null,false,null,10,false]
[null,"Porsche","911 GT2 (996)",2002,2004,3175,456,457,456.33333333333331,6.9576333089846605,82.430058436815187,85,12.5,94.930058436815187,"T90",false,null,false,null,12.5,false]
[null,"Porsche","911 GT2 (997)",2008,2009,3175,530,505,521.66666666666663,6.0862619808306713,86.133386581469651,85,12.5,98.633386581469651,"T90",false,null,false,null,12.5,false]
[null,"Porsche","911 GT2 (997)",2011,2011,3075,620,516,585.33333333333326,5.2534168564920281,89.672978359908882,90,15,104.67297835990888,"T100",false,null,false,null,15,false]
[null,"Porsche","911 GT3",2015,null,3153,475,324,424.66666666666663,7.4246467817896393,80.445251177394027,105,22.5,102.94525117739403,"T100",false,null,false,null,22.5,false]
[null,"Porsche","911 GT3 (996)",2004,2004,3043,380,284,348,8.7442528735632177,74.836925287356323,85,12.5,87.336925287356323,"T80",false,null,false,null,12.5,false]
[null,"Porsche","911 GT3 (997)",2007,2007,3076,415,300,376.66666666666663,8.1663716814159297,77.292920353982296,90,15,92.292920353982296,"T90",false,null,false,null,15,false]
[null,"Porsche","911 GT3RS (997)",2010,2011,3020,450,317,405.66666666666663,7.4445357436318824,80.360723089564502,95,17.5,97.860723089564502,"T90",false,null,false,null,17.5,false]
[null,"Porsche","911 GTS",2012,2012,3430,408,310,375.33333333333331,9.1385435168738898,73.161190053285964,90,15,88.161190053285964,"T80",false,null,false,null,15,false]
[null,"Porsche","911 Turbo (930)",1986,1989,2976,282,289,284.33333333333331,10.466588511137164,67.516998827667052,70,5,72.516998827667052,"T70",false,null,false,null,5,false]
[null,"Porsche","911 Turbo (965)",1989,1994,3274,315,332,320.66666666666663,10.209979209979211,68.607588357588355,75,7.5,76.107588357588355,"T70",false,null,false,null,7.5,false]
[null,"Porsche","911 Turbo (993)",1996,1997,3307,408,398,404.66666666666663,8.172158154859968,77.268327841845135,80,10,87.268327841845135,"T80",false,null,false,null,10,false]
[null,"Porsche","911 Turbo (996)",2002,2002,3388,415,415,414.99999999999994,8.1638554216867476,77.303614457831316,85,12.5,89.803614457831316,"T80",false,null,false,null,12.5,false]
[null,"Porsche","911 Turbo (997)",2007,2007,3495,480,460,473.33333333333331,7.3838028169014089,80.618838028169009,85,12.5,93.118838028169009,"T90",false,null,false,null,12.5,false]
[null,"Porsche","914-6 GT",1973,1973,2200,130,131,130.33333333333331,16.879795396419439,40.260869565217376,70,5,45.260869565217376,"T40",false,null,false,null,5,false]
[null,"Porsche","924 S",1988,1988,2734,160,155,158.33333333333331,17.267368421052634,38.613684210526301,55,-2.5,36.113684210526301,"T30",false,null,false,null,-2.5,false]
[null,"Porsche","928 GT",1990,1991,3505,330,317,325.66666666666663,10.762538382804506,66.259211873080858,60,0,66.259211873080858,"T60",false,null,false,null,0,false]
[null,"Porsche","928 GTS",1993,1995,3593,350,369,356.33333333333331,10.083255378858746,69.146164639850326,60,0,69.146164639850326,"T60",false,null,false,null,0,false]
[null,"Porsche","944 S2",1989,1991,2998,208,207,207.66666666666666,14.436597110754414,50.644462279293741,65,2.5,53.144462279293741,"T50",false,null,false,null,2.5,false]
[null,"Porsche","944 Turbo",1986,1988,2998,220,243,227.66666666666666,13.168374816983896,56.034407027818446,65,2.5,58.534407027818446,"T50",false,null,false,null,2.5,false]
[null,"Porsche","944 Turbo",1989,1989,2998,250,258,252.66666666666666,11.865435356200528,61.571899736147756,65,2.5,64.071899736147756,"T60",false,null,false,null,2.5,false]
[null,"Porsche","Boxster",1997,1999,2822,201,181,194.33333333333331,14.521440823327618,50.283876500857623,70,5,55.283876500857623,"T50",false,null,false,null,5,false]
[null,"Porsche","Boxster",2000,2002,2778,217,192,208.66666666666666,13.313099041533548,55.419329073482423,70,5,60.419329073482423,"T60",false,null,false,null,5,false]
[null,"Porsche","Boxster",2003,2004,2778,228,192,216,12.861111111111111,57.340277777777779,75,7.5,64.840277777777771,"T60",false,null,false,null,7.5,false]
[null,"Porsche","Boxster",2005,2006,2855,240,199,226.33333333333331,12.614138438880708,58.389911634756992,75,7.5,65.889911634756999,"T60",false,null,false,null,7.5,false]
[null,"Porsche","Boxster",2007,2008,2855,245,201,230.33333333333331,12.395079594790161,59.320911722141815,75,7.5,66.820911722141815,"T60",false,null,false,null,7.5,false]
[null,"Porsche","Boxster",2009,2011,2943,255,214,241.33333333333331,12.19475138121547,60.172306629834253,75,7.5,67.672306629834253,"T60",false,null,false,null,7.5,false]
[null,"Porsche","Boxster S",2000,2002,2855,250,225,241.66666666666666,11.813793103448276,61.791379310344823,75,7.5,69.291379310344823,"T60",false,null,false,null,7.5,false]
[null,"Porsche","Boxster S",2003,2004,2999,258,229,248.33333333333331,12.076510067114095,60.674832214765097,80,10,70.674832214765104,"T70",false,null,false,null,10,false]
[null,"Porsche","Boxster S",2005,2006,2965,280,236,265.33333333333331,11.174623115577891,64.507851758793961,80,10,74.507851758793961,"T70",false,null,false,null,10,false]
[null,"Porsche","Boxster S",2007,2008,2965,295,251,280.33333333333331,10.576694411414984,67.04904875148631,80,10,77.04904875148631,"T70",false,null,false,null,10,false]
[null,"Porsche","Boxster S",2009,2011,2987,310,265,295,10.125423728813558,68.966949152542384,80,10,78.966949152542384,"T70",false,null,false,null,10,false]
[null,"Porsche","Carrera (997)",2005,2008,3075,325,273,307.66666666666663,9.9945828819068261,69.523022751895979,80,10,79.523022751895979,"T70",false,null,false,null,10,false]
[null,"Porsche","Carrera GT",2004,2007,3000,612,435,553,5.4249547920433994,88.943942133815554,90,15,103.94394213381555,"T100",false,null,false,null,15,false]
[null,"Porsche","Cayenne GTS",2013,2014,4597,420,380,406.66666666666663,11.304098360655738,63.957581967213116,55,-2.5,61.457581967213116,"T60",false,null,false,null,-2.5,false]
[null,"Porsche","Cayenne Turbo",2003,2006,5200,450,460,453.33333333333331,11.470588235294118,63.25,50,-5,58.25,"T50",false,null,false,null,-5,false]
[null,"Porsche","Cayman (987.1)",2006,2008,2866,245,201,230.33333333333331,12.442836468885673,59.117945007235889,80,10,69.117945007235889,"T60",false,null,false,null,10,false]
[null,"Porsche","Cayman (987.2)",2009,2012,2932,265,221,{"$f":"G396*(2/3)+H396*(1/3)","v":250.33333333333331},{"$f":"F396/I396","v":11.712383488681759},{"$f":"J396*-4.25+112","v":62.222370173102526},80,{"$f":"(L396-60)/3*1.5","v":10},72.222370173102519,{"$f":"INDEX(Base_Classes, MATCH($N396, Base_Assessments, 1)+1)","v":"T70"},{"$f":"OR(R396,A396)","v":false},null,false,null,10,{"$f":"AND(P396,$S$9)","v":false}]
[null,"Porsche","Cayman (981)",2014,2016,2888,275,213,254.33333333333331,11.355176933158585,63.740498034076012,80,10,{"$f":"M397+K397","v":73.740498034076012},"T70",false,null,false,null,{"$f":"(L397-60)/3*1.5","v":10},false]
[null,"Porsche","718 Cayman /T (982)",2017,null,2943,300,280,293.33333333333331,10.032954545454546,69.359943181818181,80,10,79.359943181818181,"T70",false,null,false,null,10,false]
[null,"Porsche","Cayman GT4 (918)",2015,2016,2955,385,309,359.66666666666663,8.215940685820204,77.08225208526413,90,15,92.08225208526413,"T90",false,null,false,null,15,false]
[null,"Porsche","Cayman GTS",2018,null,3031,365,309,346.33333333333331,8.7516843118383072,74.805341674687185,80,10,84.805341674687185,"T80",false,null,false,null,10,false]
[null,"Porsche","Cayman S (987.1)",2006,2008,2954,295,251,280.33333333333331,10.537455410225922,67.215814506539829,80,10,77.215814506539829,"T70",false,null,false,null,10,false]
[null,"Porsche","Cayman S/R (987.2)",2009,2012,2976,320,273,304.33333333333331,9.7787513691128147,70.440306681270528,80,10,80.440306681270528,"T80",false,null,false,null,10,false]
[null,"Porsche","Cayman S/GTS (981)",2014,2016,2910,325,273,307.66666666666663,9.4582881906825573,71.802275189599129,80,10,81.802275189599129,"T80",false,null,false,null,10,false]
[null,"Porsche","718 Cayman S/GTS (982)",2017,null,2987,350,309,336.33333333333331,8.8810703666997028,74.255450941526263,80,10,84.255450941526263,"T80",false,null,false,null,10,false]
[null,"Porsche","Panamera Turbo",2010,2016,4343,500,516,505.33333333333331,8.5943271767810021,75.474109498680747,75,7.5,82.974109498680747,"T80",false,null,false,null,7.5,false]
[null,"Saab","900 Turbo",1990,1993,2967,175,195,181.66666666666666,16.332110091743122,42.588532110091734,55,-2.5,40.088532110091734,"T40",false,null,false,null,-2.5,false]
[null,"Saab","9000 Aero",1993,1997,3250,225,258,236,13.771186440677965,53.472457627118644,55,-2.5,50.972457627118644,"T50",false,null,false,null,-2.5,false]
[null,"Saab","9-3 Vector",2002,2003,3285,210,221,213.66666666666666,15.374414976599065,46.658736349453974,50,-5,41.658736349453974,"T40",false,null,false,null,-5,false]
[null,"Saab","9-3 Viggen",1999,2002,2987,230,258,239.33333333333331,12.480501392757661,58.957869080779936,60,0,58.957869080779936,"T50",false,null,false,null,0,false]
[null,"Saab","9-5 Aero",2000,2002,3470,250,258,252.66666666666666,13.733509234828496,53.632585751978894,55,-2.5,51.132585751978894,"T50",false,null,false,null,-2.5,false]
[null,"Saab","9-5 SE",1999,2003,3280,170,207,182.33333333333331,17.989031078610605,35.546617915904932,50,-5,30.546617915904932,"T30",false,null,false,null,-5,false]
[null,"Saleen","S7",2000,2004,2750,500,525,508.33333333333331,5.4098360655737707,89.008196721311478,95,17.5,106.50819672131148,"T100",false,null,false,null,17.5,false]
[null,"Saleen","S7 Twin Turbo",2005,2009,2950,750,700,733.33333333333326,4.0227272727272734,94.903409090909093,95,17.5,112.40340909090909,"T110",false,null,false,null,17.5,false]
[null,"Scion","FR-S",2013,2016,2758,200,151,183.66666666666663,15.016333938294014,48.180580762250436,70,5,55.1,"T50",false,null,false,null,5,false]
[null,"Scion","tC",2005,2010,2970,160,163,161,18.447204968944099,33.599378881987576,60,0,{"$f":"M415+K415","v":33.599378881987576},"T30",false,null,false,null,0,false]
[null,"Smart","Fortwo",2007,null,1808,70,68,69.333333333333329,26.07692307692308,1.1730769230769056,40,-10,-8.8269230769230944,"T30",false,null,false,null,-10,false]
[null,"Subaru","BRZ",2022,null,2815,228,184,213.33333333333331,13.195312500000002,55.919921874999993,78,9,64.919921875,"T60",false,null,false,null,9,false]
[null,"Subaru","BRZ",2013,2017,2760,200,151,183.66666666666663,15.027223230490021,48.13430127041741,75,7.5,55.63430127041741,"T50",false,null,false,null,7.5,false]
[null,"Subaru","BRZ",2017,2020,2777,205,156,188.66666666666666,14.719081272084807,49.443904593639573,75,7.5,56.943904593639573,"T50",false,null,false,null,7.5,false]
[null,"Subaru","BRZ Performance Pack",2017,2020,2777,205,156,188.66666666666666,14.719081272084807,49.443904593639573,78,9,58.443904593639573,"T50",false,null,false,null,9,false]
[null,"Subaru","Forester",1998,1998,3040,165,162,164,18.536585365853657,33.219512195121951,35,-12.5,20.719512195121951,"T30",false,null,false,null,-12.5,false]
[null,"Subaru","Forester 2.5 XT",2004,2005,3270,210,235,218.33333333333331,14.977099236641223,48.347328244274806,50,-5,43.347328244274806,"T40",false,null,false,null,-5,false]
[null,"Subaru","Impreza 2.5 RS",2000,2001,2845,165,162,164,17.347560975609756,38.27286585365853,60,0,38.27286585365853,"T30",false,null,false,null,0,false]
[null,"Subaru","Impreza L",1998,null,2795,137,145,139.66666666666666,20.011933174224346,26.949284009546531,50,-5,21.949284009546531,"T30",false,null,false,null,-5,false]
[null,"Subaru","Impreza Sport",2017,null,3015,152,145,149.66666666666666,20.144766146993319,26.384743875278389,60,0,26.384743875278389,"T30",false,null,false,null,0,false]
[null,"Subaru","Impreza WRX",2022,null,3525,271,258,266.66666666666663,13.218750000000002,55.820312499999993,72.5,6.25,62.070312499999993,"T60",false,null,false,null,6.25,false]
[null,"Subaru","Impreza WRX",2002,2005,3085,227,217,223.66666666666663,13.792846497764533,53.380402384500734,60,0,53.380402384500734,"T50",false,null,false,null,0,false]
[null,"Subaru","Impreza WRX",2008,2008,3142,224,226,224.66666666666663,13.985163204747776,52.563056379821951,60,0,52.563056379821951,"T50",false,null,false,null,0,false]
[null,"Subaru","Impreza WRX",2011,2014,3208,265,244,258,12.434108527131784,59.155038759689916,65,2.5,61.655038759689916,"T60",false,null,false,null,2.5,false]
[null,"Subaru","Impreza WRX",2015,2021,3364,268,258,264.66666666666663,12.710327455919398,57.981108312342556,70,5,62.981108312342556,"T60",false,null,false,null,5,false]
[null,"Subaru","Impreza WRX STi",2004,2004,3263,300,300,300,10.876666666666667,65.774166666666673,80,10,75.774166666666673,"T70",false,null,false,null,10,false]
[null,"Subaru","Impreza WRX Sti",2005,2005,3298,300,300,300,10.993333333333334,65.278333333333336,80,10,75.278333333333336,"T70",false,null,false,null,10,false]
[null,"Subaru","Impreza WRX Sti",2006,2006,3351,300,300,300,11.17,64.527500000000003,80,10,74.527500000000003,"T70",false,null,false,null,10,false]
[null,"Subaru","Impreza WRX STi",2008,2014,3384,305,290,300,11.28,64.06,80,10,74.06,"T70",false,null,false,null,10,false]
[null,"Subaru","Impreza WRX STi",2015,2018,3386,305,290,300,11.286666666666667,64.031666666666666,80,10,74.031666666666666,"T70",false,null,false,null,10,false]
[null,"Subaru","Legacy 2.5 GT",1994,1999,3130,165,162,164,19.085365853658537,30.887195121951223,50,-5,25.887195121951223,"T30",false,null,false,null,-5,false]
[null,"Subaru","Legacy 2.5 GT Spec B",2006,2006,3400,250,250,250,13.6,54.2,55,-2.5,51.7,"T50",false,null,false,null,-2.5,false]
[null,"Tesla","Model 3 Long Range RWD",2018,null,3838,271,307,283,13.561837455830389,54.362190812720847,65,2.5,56.862190812720847,"T50",false,null,false,null,2.5,false]
[null,"Tesla","Roadster Sport 2.5",2008,2012,2723,288,295,290.33333333333331,9.3788748564867976,72.139781859931105,75,7.5,79.639781859931105,"T70",false,null,false,null,7.5,false]
[null,"Toyota"," Corolla Hybrid XLE",2023,2023,2850,134,156,141.33333333333331,20.165094339622645,26.298349056603755,55,-2.5,23.798349056603755,"T30",false,null,false,null,-2.5,false]
[null,"Toyota",86,2022,null,2815,228,184,213.33333333333331,13.195312500000002,55.919921874999993,75,7.5,63.419921874999993,"T60",false,null,false,null,{"$f":"(L441-60)/3*1.5","v":7.5},false]
[null,"Toyota",86,2017,2020,2777,205,156,188.66666666666666,14.719081272084807,49.443904593639573,75,7.5,56.943904593639573,"T50",false,null,false,null,7.5,false]
[null,"Toyota","86 Spec Ed ( perf pack)",2017,2020,2777,205,156,188.66666666666666,14.719081272084807,49.443904593639573,78,9,58.443904593639573,"T50",false,null,false,null,9,false]
[null,"Toyota","Celica GT-S",1985,1989,2703,135,125,131.66666666666666,20.529113924050634,24.751265822784802,50,-5,19.751265822784802,"T30",false,null,false,null,-5,false]
[null,"Toyota","Corolla GT-S (AE86)",1987,1987,2200,112,97,106.99999999999999,20.560747663551403,24.616822429906534,40,-10,14.616822429906534,"T30",false,null,false,null,-10,false]
[null,"Toyota","Matrix",2010,null,2865,132,128,130.66666666666666,21.926020408163268,18.814413265306115,50,-5,13.814413265306115,"T30",false,null,false,null,-5,false]
[null,"Toyota","Matrix S",2010,null,3360,158,162,159.33333333333331,21.087866108786613,22.376569037656893,50,-5,{"$f":"M447+K447","v":17.376569037656893},"T30",false,null,false,null,-5,false]
[null,"Toyota","Matrix XRS",2010,null,3220,158,162,159.33333333333331,20.209205020920503,26.110878661087867,50,-5,21.110878661087867,"T30",false,null,false,null,-5,false]
[null,"Toyota","MR2",1990,1999,2599,135,145,138.33333333333331,18.787951807228918,32.151204819277098,60,0,32.151204819277098,"T30",false,null,false,null,0,false]
[null,"Toyota","MR2 N/A",1987,1989,2350,115,110,113.33333333333331,20.735294117647062,23.874999999999986,55,-2.5,21.374999999999986,"T30",false,null,false,null,-2.5,false]
[null,"Toyota","MR2 Supercharged",1988,1988,2494,145,140,143.33333333333331,17.400000000000002,38.049999999999997,55,-2.5,35.549999999999997,"T30",false,null,false,null,-2.5,false]
[null,"Toyota","MR2 Sypder",2000,2007,2195,138,125,133.66666666666666,16.4214463840399,42.20885286783043,70,5,47.20885286783043,"T40",false,null,false,null,5,false]
[null,"Toyota","MR2 Turbo",1990,1999,2782,200,200,199.99999999999997,13.910000000000002,52.882499999999993,60,0,52.882499999999993,"T50",false,null,false,null,0,false]
[null,"Toyota","Supra 2.0",2021,null,3181,255,295,268.33333333333331,11.854658385093169,61.617701863354036,85,12.5,74.117701863354029,"T70",false,null,false,null,12.5,false]
[null,"Toyota ","Supra 3.0",2020,null,3397,335,365,345,9.8463768115942027,70.152898550724643,85,12.5,82.652898550724643,"T80",false,null,false,null,12.5,false]
[null,"Toyota ","Supra 3.0",2021,null,3400,382,368,377.33333333333331,9.010600706713781,73.704946996466433,85,12.5,86.204946996466433,"T80",false,null,false,null,12.5,false]
[null,"Triumph","TR4",1961,1965,2130,100,127,108.99999999999999,19.541284403669728,28.949541284403651,30,-15,13.949541284403651,"T30",false,null,false,null,-15,false]
[null,"Triumph","TR6",1969,1976,2491,106,133,114.99999999999999,21.660869565217393,19.941304347826076,25,-17.5,2.4413043478260761,"T30",false,null,false,null,-17.5,false]
[null,"Triumph","TR7 Convertible",1979,1979,2469,85,101,90.333333333333329,27.332103321033212,-4.1614391143911575,40,-10,-14.161439114391158,"T30",false,null,false,null,-10,false]
[null,"Triumph","TR7/8 Convertible",1979,1980,2654,137,165,{"$f":"G460*(2/3)+H460*(1/3)","v":146.33333333333331},{"$f":"F460/I460","v":18.136674259681097},{"$f":"J460*-4.25+112","v":34.919134396355332},45,{"$f":"(L460-60)/3*1.5","v":-7.5},27.419134396355332,{"$f":"INDEX(Base_Classes, MATCH($N460, Base_Assessments, 1)+1)","v":"T30"},{"$f":"OR(R460,A460)","v":false},null,false,null,-7.5,{"$f":"AND(P460,$S$9)","v":false}]
[null,"Ultima","GTR",2006,null,2183,534,528,532,4.1033834586466167,94.560620300751879,115,27.5,122.06062030075188,"T110",false,null,false,null,27.5,false]
[null,"Ultima","GTR720",2006,null,2183,720,580,673.33333333333326,3.2420792079207925,98.221163366336626,115,27.5,125.72116336633663,"T110",false,null,false,null,27.5,false]
[null,"Volkswagen","Golf GTI",1998,1998,2565,115,122,117.33333333333331,21.860795454545457,19.091619318181813,50,-5,14.091619318181813,"T30",false,null,false,null,-5,false]
[null,"Volkswagen","Golf GTI 1.8T",2000,2000,2906,150,155,151.66666666666666,19.16043956043956,30.568131868131871,55,-2.5,28.068131868131871,"T30",false,null,false,null,-2.5,false]
[null,"Volkswagen","Golf GTI 1.8T",2002,2002,2935,180,174,178,16.488764044943821,41.922752808988761,55,-2.5,39.422752808988761,"T30",false,null,false,null,-2.5,false]
[null,"Volkswagen","Golf R",2015,null,3340,292,280,288,11.597222222222221,62.711805555555557,75,7.5,70.211805555555557,"T70",false,null,false,null,7.5,false]
[null,"Volkswagen","Golf R32",2004,2004,3256,241,236,239.33333333333331,13.604456824512535,54.181058495821723,70,5,59.181058495821723,"T50",false,null,false,null,5,false]
[null,"Volkswagen","Golf R32",2008,2008,3547,250,236,245.33333333333331,14.457880434782609,50.554008152173907,75,7.5,58.054008152173907,"T50",false,null,false,null,7.5,false]
[null,"Volkswagen","GTI Coupe",2007,2009,3161,200,207,202.33333333333331,15.622734761120265,45.603377265238876,60,0,45.603377265238876,"T40",false,null,false,null,0,false]
[null,"Volkswagen","Jetta 2.0T",2006,2006,3259,200,207,202.33333333333331,16.10708401976936,43.544892915980228,55,-2.5,41.044892915980228,"T40",false,null,false,null,-2.5,false]
[null,"Volkswagen","Jetta 2.5L",2005,2005,3230,150,170,156.66666666666666,20.617021276595747,24.377659574468083,55,-2.5,21.877659574468083,"T30",false,null,false,null,-2.5,false]
[null,"Volkswagen","Jetta SE",2011,null,3018,170,177,172.33333333333331,17.512572533849131,37.571566731141189,55,-2.5,35.071566731141189,"T30",false,null,false,null,-2.5,false]
[null,"Volkswagen","Jetta VR6 GLS",2002,2002,3113,174,181,176.33333333333331,17.654064272211723,36.970226843100178,50,-5,31.970226843100178,"T30",false,null,false,null,-5,false]
[null,"Volkswagen","New Beetle GLS 1.8T",2000,2000,2875,150,162,154,18.668831168831169,32.657467532467535,55,-2.5,30.157467532467535,"T30",false,null,false,null,-2.5,false]
[null,"Volkswagen","Rabbit 2.5L Coupe",2007,2007,3072,150,170,156.66666666666666,19.608510638297872,28.66382978723405,55,-2.5,26.16382978723405,"T30",false,null,false,null,-2.5,false]
[null,"Volkswagen","Rabbit GTI",1984,1984,1990,90,100,93.333333333333329,21.321428571428573,21.383928571428569,40,-10,11.383928571428569,"T30",false,null,false,null,-10,false]
[null,"Volkswagen","Scirocco 16V",1984,1984,2530,123,120,122,20.737704918032787,23.864754098360663,40,-10,13.864754098360663,"T30",false,null,false,null,-10,false]
[null,"Volkswagen ","Mk7 GTI",2015,2021,3116,220,258,232.66666666666666,13.392550143266476,55.081661891117477,70,5,60.081661891117477,"T60",false,null,false,null,5,false]
[null,"Volkswagon","Golf TDI",1991,1999,2450,108,173,129.66666666666666,18.894601542416453,31.697943444730072,50,-5,{"$f":"M479+K479","v":26.697943444730072},"T30",false,null,false,null,-5,false]
[null,"Volkswagon","Jetta GLI-S",2019,null,3217,228,258,238,13.516806722689076,54.553571428571431,70,5,59.553571428571431,"T50",false,null,false,null,5,false]
[null,"Volkswagon","Mk6 Golf GTI",2010,2014,3100,200,207,202.33333333333331,15.321252059308074,46.884678747940683,65,2.5,49.384678747940683,"T40",false,null,false,null,2.5,false]
[null,"Volkswagon","Mk7 GTI-S",2015,null,3116,220,258,232.66666666666666,13.392550143266476,55.081661891117477,70,5,60.081661891117477,"T60",false,null,false,null,5,false]
[null,"Volkswagon","Mk8 Golf R",2022,null,3360,315,310,313.33333333333331,10.723404255319149,66.425531914893611,80,10,76.425531914893611,"T70",false,null,false,null,10,false]
[null,"Volvo","V60 Polestar",2017,null,3966,362,347,357,11.109243697478991,64.785714285714278,75,7.5,72.285714285714278,"T70",false,null,false,null,7.5,false]
[null,null,null,null,null,null,null,null,null,null,null,null,null,null,null,{"$f":"OR(R485,A485)","v":false},null,false,null,null,{"$f":"AND(P485,$S$9)","v":false}]
[null,null,null,null,null,null,null,null,null,null,null,null,null,null,null,false,null,false,null,null,false]
[null,null,null,null,null,null,null,null,null,null,null,null,null,null,null,false,null,false,null,null,false]
[null,null,null,null,null,null,null,null,null,null,null,null,null,null,null,false,null,false,null,null,false]
[null,null,null,null,null,null,null,null,null,null,null,null,null,null,null,false,null,false,null,null,false]
[null,null,null,null,null,null,null,null,null,null,null,null,null,null,null,false,null,false,null,null,false]
[null,null,null,null,null,null,null,null,null,null,null,null,null,null,null,false,null,false,null,null,false]
[null,null,null,null,null,null,null,null,null,null,null,null,null,null,null,false,null,false,null,null,false]
[null,null,null,null,null,null,null,null,null,null,null,null,null,null,null,false,null,false,null,null,false]
[null,null,null,null,null,null,null,null,null,null,null,null,null,null,null,false,null,false,null,null,false]
[null,null,null,null,null,null,null,null,null,null,null,null,null,null,null,false,null,false,null,null,false]
[null,null,null,null,null,null,null,null,null,null,null,null,null,null,null,false,null,false,null,null,false]
[null,null,null,null,null,null,null,null,null,null,null,null,null,null,null,false,null,false,null,null,false]
[null,null,null,null,null,null,null,null,null,null,null,null,null,null,null,false,null,false,null,null,false]
[null,null,null,null,null,null,null,null,null,null,null,null,null,null,null,false,null,false,null,null,false]
[null,null,null,null,null,null,null,null,null,null,null,null,null,null,null,false,null,false,null,null,false]
[null,null,null,null,null,null,null,null,null,null,null,null,null,null,null,false,null,false,null,null,false]
[null,null,null,null,null,null,null,null,null,null,null,null,null,null,null,false,null,false,null,null,false]
[null,null,null,null,null,null,null,null,null,null,null,null,null,null,null,false,null,false,null,null,false]
[null,null,null,null,null,null,null,null,null,null,null,null,null,null,null,false,null,false,null,null,false]
[null,null,null,null,null,null,null,null,null,null,null,null,null,null,null,false,null,false,null,null,false]
[null,null,null,null,null,null,null,null,null,null,null,null,null,null,null,false,null,false,null,null,false]
[null,null,null,null,null,"`",null,null,null,null,null,null,null,null,null,false,null,false,null,null,false]

{"sheet":"Engine","index":3,"n_rows":82,"n_cols":11,"rows_kept":82,"cut":false,"hidden":false,"merged":[[0,0,0,2],[65,2,66,2]]}
[{"$f":"CONCATENATE(Title, \" \", Version)","v":"COMSCC 2024 v12.0"}]
[]
["Touring Class Summary"]
[]
["Engine Modifications Worksheet"]
["Click \"Select\" where appropriate and enter information in the yellow cells…"]
[]
["Select or TRUE","Assessment","Description",null,null,null,{"$f":"IF(H8>0, TRUE, FALSE)","v":false},{"$f":"COUNTIF(H9:H58, TRUE)","v":0},null,{"$f":"COUNTIF(J9:J58,\"Dyno\")","v":0}]
[null,1,"Reprogrammed Factory Trim (includes ROM chips) ECU, naturally aspirated engine",false,false,{"$f":"IF(D9, B9, 0)","v":0},{"$f":"COUNTIF(D9:D12, TRUE)","v":0},{"$f":"G9>1","v":false},{"$f":"AND(D9, $H$9)","v":false},null,{"$f":"INDEX(Public_Engine_Mods,1,6)>0","v":false}]
[null,2,"Non-Factory Trim ECU, naturally aspirated engine",false,false,{"$f":"IF(D10, B10, 0)","v":0},{"$f":"COUNTIF(D9:D12, TRUE)","v":0},null,{"$f":"AND(D10, $H$9)","v":false},null,{"$f":"INDEX(Public_Engine_Mods,2,6)>0","v":false}]
[null,3,"Reprogrammed Factory Trim (includes ROM chips) ECU, forced induction engine air/fuel change only. If applicable, additional points must be added for an increase in boost.",false,false,0,{"$f":"COUNTIF(D9:D12, TRUE)","v":0},null,{"$f":"AND(D11, $H$9)","v":false}]
[null,4,"Non-Factory Trim ECU, forced induction engine engine air/fuel change only. If applicable, additional points must be added for an increase in boost.",false,false,0,{"$f":"COUNTIF(D9:D12, TRUE)","v":0},null,{"$f":"AND(D12, $H$9)","v":false}]
[null,2,"Turbo Boost increase <50%",{"$f":"OR(E13,A13)","v":false},false,0,{"$f":"COUNTIF(D13:D14, TRUE)","v":0},{"$f":"G13>1","v":false},{"$f":"AND(D13, $H$13)","v":false}]
[null,4,"Turbo Boost increase >50%",false,false,0,{"$f":"COUNTIF(D13:D14, TRUE)","v":0},null,{"$f":"AND(D14, $H$13)","v":false}]
[null,1,"Non-Factory Trim/modified air intake before the throttle body",false,false,0,{"$f":"COUNTIF(D15:D16, TRUE)","v":0},{"$f":"G15>1","v":false},{"$f":"AND(D15, $H$15)","v":false}]
[null,1,"Non-factory trim/modified headlight to allow increased or cooler air flow to engine air intake, unless already taking one point for cold air intake.",false,false,0,{"$f":"COUNTIF(D15:D16, TRUE)","v":0},null,{"$f":"AND(D16, $H$15)","v":false}]
[null,1,"Non-Factory Trim/modified throttle body",false,false,0,null,null,false]
[null,1,"Non-Factory Trim/modified fuel delivery system, except fuel pump(s) (i.e. fuel injectors, fuel rails, fuel regulators)",false,false,0,null,null,false]
[null,1,"Non-Factory Trim/modified intake manifold 1-6 cylinder engines, including manifold porting",false,false,0,{"$f":"COUNTIF(D19:D20, TRUE)","v":0},{"$f":"G19>1","v":false},{"$f":"AND(D19, $H$19)","v":false}]
[null,2,"Non-Factory Trim/modified intake manifold 7-12 cylinder engines, including manifold porting",false,false,0,{"$f":"COUNTIF(D19:D20, TRUE)","v":0},null,{"$f":"AND(D20, $H$19)","v":false}]
[null,3,"Water-alcohol injection System",false,false,0,null,null,false]
[null,"Dyno","Non-Factory Trim/modified supercharger or turbocharger, any location",false,false,0,null,{"$f":"G22>1","v":false},false,{"$f":"F22","v":0}]
[null,3,"Non-Factory Trim/modified supercharger pulley",false,false,0,null,null,false]
[null,3,"Non-Factory Trim/modified boost controller or vacuum lines that control boost",false,false,0,null,null,false]
[null,1,"Non-Factory Trim/modified wastegate, wastegate actuator",false,false,0,null,null,false]
[null,2,"Non-Factory Trim/modified intercooler",false,false,0,{"$f":"COUNTIF(D26:D27, TRUE)","v":0},null,false]
[null,1,"Non-Factory Trim/modified intercooler pipes only",false,false,0,{"$f":"COUNTIF(D26:D27, TRUE)","v":0},null,false]
[null,"Dyno","Non-Factory Trim/modified camshafts, rocker arms, pushrods, or cam gears that adjust cam timing or lift",false,false,0,{"$f":"COUNTIF(D28:D31, TRUE)","v":0},{"$f":"G28>1","v":false},false,{"$f":"F28","v":0}]
[null,"Dyno","Ported/polished Factory Trim cylinder heads",false,false,0,0,null,false,{"$f":"F29","v":0}]
[null,"Dyno","Non-Factory Trim cylinder heads",false,false,0,0,null,false,{"$f":"F30","v":0}]
[null,"Dyno","Non-Factory Trim/modified engine intake/exhaust valves",false,false,0,0,null,false,{"$f":"F31","v":0}]
[null,"Dyno","Increased displacement by more than 1%",false,false,0,0,{"$f":"G32>1","v":false},false,{"$f":"F32","v":0}]
[null,0,"Increase compression ratio by .50 or less",false,false,0,{"$f":"COUNTIF(D33:D34, TRUE)","v":0},{"$f":"G33>1","v":false},{"$f":"AND(D33, $H$33)","v":false}]
[null,"Dyno","Increase compression ratio greater than .50",false,false,0,{"$f":"COUNTIF(D33:D34, TRUE)","v":0},null,{"$f":"AND(D34, $H$33)","v":false},{"$f":"F34","v":0}]
[null,1,"Dry sump engine oil system",false,false,0,null,null,false]
[null,1,"Non-Factory Trim/modified header 1-6 cyl (pre-cat exhaust change)",false,false,0,{"$f":"COUNTIF(D36:D37, TRUE)","v":0},{"$f":"G36>1","v":false},{"$f":"AND(D36, $H$36)","v":false}]
[null,2,"Non-Factory Trim/modified header 7-12 cyl (pre-cat exhaust change)",false,false,0,{"$f":"COUNTIF(D36:D37, TRUE)","v":0},null,{"$f":"AND(D37, $H$36)","v":false}]
[null,1,"Non-Factory Trim/modified exhaust beyond the catalytic converter (e.g. cat back exhaust) ",false,false,0,{"$f":"COUNTIF(D38:D41, TRUE)","v":0},null,false]
[null,1,"Non-Factory Trim/modified catalytic converter(s)",false,false,0,{"$f":"COUNTIF(D39:D40, TRUE)","v":0},{"$f":"G39>1","v":false},{"$f":"AND(D39, $H$39)","v":false}]
[null,1,"Complete removal or “gutting” of OEM catalytic converter(s) (i.e. “test pipe” in place of catalytic converter)",false,false,0,{"$f":"COUNTIF(D39:D40, TRUE)","v":0},null,{"$f":"AND(D40, $H$39)","v":false}]
[null,1,"Non-Factory Trim/modified power steering, crank pulley",false,false,0,null,null,false]
[null,1,"Non-Factory Trim/modified/deleted engine or accessory fan and/or other engine accessories not otherwise listed",false,false,0,null,null,false]
[null,"Dyno","Street Port, rotary engines",false,false,0,{"$f":"COUNTIF(D43:D44, TRUE)","v":0},{"$f":"G43>1","v":false},false,{"$f":"F43","v":0}]
[null,"Dyno","Bridge Port, rotary engines",false,false,0,{"$f":"COUNTIF(D43:D44, TRUE)","v":0},null,false,{"$f":"F44","v":0}]
[null,"Dyno","Peripheral Port, rotary engines",false,false,0,null,null,false,{"$f":"F45","v":0}]
[null,"Dyno","Non-Factory Trim/modified Pistons, Rods",false,false,0,null,null,false,{"$f":"F46","v":0}]
[null,"Dyno","Vehicles tuned and running ethanol content greater than 15%. (E.g. a vehicle tuned to run on e85)",false,false,0,null,null,false,{"$f":"F47","v":0}]
[null,0,"Any type of commercially available gasoline or diesel fuel",false,false,0]
[null,0,"Non-Factory Trim/modified fuses, relays, wiring, or addition of Power Distribution Modules",false,false,0]
[null,0,"Non-Factory Trim hoses, belts, clamps",false,false,0]
[null,0,"Non-Factory Trim air or fuel filters",false,false,0]
[null,0,"Non-Factory Trim radiator",false,false,0]
[null,0,"Non-Factory Trim battery, starter motor, alternator, spark plugs, spark plug wires, ignition coils",false,false,0]
[null,0,"Non-Factory Trim/modifications to oil system",false,false,0]
[null,0,"Non-Factory Trim/modifications/number of fuel pumps",false,false,0]
[null,0,"Non-Factory Trim/modified muffler tips/components designed strictly for the purposes of reducing sound with no measurable or theoretical performance advantage (e.g. exhaust tip turn-down or second muffler)",false,false,0]
[null,0,"Factory specification engine rebuild and head shave",false,false,0]
[null,0,"Accessories and/or gauges",false,false,0]
["Total",{"$f":"IF(G8, \"Select Error\", IF(J8>0,\"Dyno Required\",SUM(F9:F58)))","v":0}]
["Note – Mazda Rotary Engines  are to be considered 4 cylinder engines for the purposes of Engine Modification point Assessments outlined in the table above"]
[]
[]
["Engine Reclass Option"]
["Dyno reclass option"]
[null,null,"Description",null,null,{"$f":"VLOOKUP(\"Dynapack\",dyno_names, 1,FALSE)","v":{"$error":"#N/A"}}]
["Horsepower",null,"For engine swaps or elective dyno based classing, competitor must provide peak horsepower figure to the Steward for evaluation; Scrutineer may request supporting documentation at the Steward’s discretion"]
["Torque",null,null,{"$f":"IF(B68=\"Crank\", 1, IF(B68=\"Wheel\", 1/(1-F74),0))","v":0}]
["Type","(Choose)","Select Crank HP or Wheel HP Dyno measurements"]
["Drivetrain type",null,"Select 2WD or AWD",null,null,"Dynojet",0.13,0.16]
["Dyno type","DynoJet","Starting with the 2018 season Dynojet is the only official dyno measurement",{"$f":"IF(B69=\"AWD\",H71,H70)","v":0}]
[{"$f":"IF(AND(ISNUMBER(B66),ISNUMBER(B67)), (B66*(2/3)*D67)+(B67*(1/3)*D67), \"\")","v":""},"Scaled Power","Scaled result using 2/3 HP + 1/3 Torque + Drivetrain loss",{"$f":"IF(B69=\"AWD\",3,2)","v":2}]
[{"$f":"IF($D72<-2, -2, $D72)","v":""},"Points","Number of points above base car assessment",{"$f":"IF(ISNUMBER(A71), ((Car_Base_Weight/A71)*-4.25+112)-Car_Scaled_Power, \"\")","v":""}]
[]
["Total Engine Modifications Assessment",{"$f":"IF(J8>0,IF(ISNUMBER(Dyno_Points),Dyno_Points,\"Dyno missing\"),IF(ISNUMBER(Scrutineer_Engine_Points),Scrutineer_Engine_Points,EngineModsTotal))","v":0},{"$f":"IF(J8>0,IF(ISNUMBER(A72),\"Using Dyno Points\",\"Dyno Required\"),IF(ISNUMBER(Scrutineer_Engine_Points),\"Using Dyno Points\",\"Using Engine Points Total\"))","v":"Using Engine Points Total"},null,null,{"$f":"VLOOKUP(B70,F69:H73,D71,FALSE)","v":0.13}]
[]
[null,"Go to next sheet (Drivetrain"]
[]
[]
[]
[]
[]
[null,"`"]

{"sheet":"Drivetrain","index":4,"n_rows":35,"n_cols":10,"rows_kept":35,"cut":false,"hidden":false,"merged":[[0,0,0,2]]}
[{"$f":"CONCATENATE(Title, \" \", Version)","v":"COMSCC 2024 v12.0"}]
[]
["Touring Class Summary"]
[]
["Drivetrain Modifications Worksheet"]
["Click \"Select\" where appropriate"]
[]
["Select or TRUE","Assessment","Description",null,null,null,{"$f":"IF(H8>0, TRUE, FALSE)","v":false},{"$f":"COUNTIF(H9:H30, TRUE)","v":0}]
[null,6,"Non-Factory Trim sequential gearbox",false,{"$f":"OR(D9, A9)","v":false},{"$f":"COUNTIF(D9:D18, TRUE)","v":0},{"$f":"IF(E9, B9, 0)","v":0},{"$f":"J9>1","v":false},{"$f":"AND(D9,H$9)","v":false},{"$f":"COUNTIF(E9:E18, TRUE)","v":0}]
[null,4,"Non-Factory Trim non-sequential (H pattern) Dogbox gearbox",false,{"$f":"OR(D10, A10)","v":false},null,{"$f":"IF(E10, B10, 0)","v":0},null,false]
[null,3,"Dual clutch transmission - DSG, DCT, PDK, etc",false,{"$f":"OR(D11, A11)","v":false},null,{"$f":"IF(E11, B11, 0)","v":0},null,false]
[null,3,"7 speed or more automatic transmission - GM HydraMatic 10L90 and 10L80, Ford 10R80, ZF HP8, Mercedes 7G-Tronic etc",false,{"$f":"OR(D12, A12)","v":false},null,0,null,false]
[null,1,"Automated single clutch manual transmission - SMG, Ferrari F1, Lambo E-Gear etc",false,{"$f":"OR(D13, A13)","v":false},null,0,null,false]
[null,1,"Manual tranmission with factory autoblip (Nissan 370Z, BMW M2, C7 Corvette, Porsche) or aftermarket add-on",false,false,null,0,null,false]
[null,0,"5 or 6 speed manual transmission",false,{"$f":"OR(D15, A15)","v":false},null,0,null,false]
[null,-1,"3 or 4 speed manual transmission",false,{"$f":"OR(D16, A16)","v":false},null,0,null,false]
[null,-2,"Automatic transmission with 6 speeds or less",false,{"$f":"OR(D17, A17)","v":false},null,0,null,false]
[null,-2,"CVT Transmission",false,{"$f":"OR(D18, A18)","v":false},null,0,null,false]
[null,1,"Non-Factory Trim/modified final drive ratio",false,false,null,0,null,false]
[null,0,"Non-Factory Trim/modified LSD if vehicle is equipped with LSD from the factory or was a factory option",false,false,{"$f":"COUNTIF(D20:D21, TRUE)","v":0},0,{"$f":"J20>1","v":false},{"$f":"AND(D20,H$20)","v":false},{"$f":"COUNTIF(E20:E21, TRUE)","v":0}]
[null,1,"Non-Factory Trim/modified LSD if vehicle is not equipped with LSD from the factory or was not a factory option",false,false,null,0,null,{"$f":"AND(D21,H$20)","v":false}]
[null,2,"Non-Factory Trim/modified traction control (ie via Non-Factory Trim ECU mapping)",false,false,null,0,null,false]
[null,2,"Non-Factory Trim/modified electronically controlled center differential mapping (ie GEMS center diff controller for Mitsubishi Evo, Subaru STi)",false,false,null,0,null,false]
[null,1,"Non-Factory Trim/modified half shafts or driveshafts including carbon fiber and aluminium driveshafts",false,false,null,0,null,false]
[null,2,"Relocation of transmission location via altered mounts",false,false,null,0,null,false]
[null,0.5,"Non-Factory Trim/modified clutch, pressure plate, and/or clutch assembly",false,false,null,0,null,false]
[null,0,"Non-Factory Trim/modified flywheel",false,{"$f":"OR(D27, A27)","v":false},null,0,null,false]
[null,0,"Non-Factory Trim/modified motor, transmission, differential, and/or other drivetrain mounts, including metallic and non-metallic mounts",false,false,null,0,null,false]
[null,0,"Non-Factory Trim/modified shifter, including bushings, lever, etc.",false,false,null,0,null,false]
[null,0,"Enabling or disabling of Factory Trim traction control",false,false,null,0,null,false]
["Total",{"$f":"IF(G8, \"Select Error\", SUM(G9:G30))","v":0}]
[]
["Total Drivetrain Modifications Assessment",{"$f":"Total","v":0}]
[]
["Go to previous sheet (Engine)","Go to next sheet (Suspension)"]

{"sheet":"Suspension","index":5,"n_rows":43,"n_cols":9,"rows_kept":43,"cut":false,"hidden":false,"merged":[[0,0,0,2]]}
[{"$f":"CONCATENATE(Title, \" \", Version)","v":"COMSCC 2024 v12.0"}]
[]
["Touring Class Summary"]
[]
["Suspension Modifications Worksheet"]
["Click \"Select\" where appropriate"]
[]
["Select or TRUE","Assessment","Description",null,null,null,{"$f":"IF(H8>0, TRUE, FALSE)","v":false},{"$f":"COUNTIF(H10:H38, TRUE)","v":0}]
[null,1,"Non-Factory Trim non-adjustable shocks, struts, dampers",{"$f":"OR(E9,A9)","v":false},false,{"$f":"IF(D9, B9, 0)","v":0},{"$f":"COUNTIF(D9:D12, TRUE)","v":0},{"$f":"G9>1","v":false},{"$f":"AND(D9,H$9)","v":false}]
[null,1,"Non-Factory Trim 1-way adjustable shocks, struts, dampers",{"$f":"OR(E10,A10)","v":false},false,{"$f":"IF(D10, B10, 0)","v":0},null,null,{"$f":"AND(D10,H$9)","v":false}]
[null,2,"Non-Factory Trim 2-way adjustable shocks, struts, dampers",{"$f":"OR(E11,A11)","v":false},false,{"$f":"IF(D11, B11, 0)","v":0},null,null,{"$f":"AND(D11,H$9)","v":false}]
[null,3,"Non-Factory Trim 3-way (or more) adjustable shocks, struts, dampers",false,false,{"$f":"IF(D12, B12, 0)","v":0},null,null,{"$f":"AND(D12,H$9)","v":false}]
[null,1,"Non-Factory Trim shocks, struts, dampers with piggyback canister or external remote canister – note: must also take points for shocks/struts/dampers as listed above",false,false,{"$f":"IF(D13, B13, 0)","v":0},null,null,false]
[null,2,"Non-adjustable non-Factory Trim coil springs, leaf springs, or torsion bars (or non-modified factory height adjustment)",false,false,0,{"$f":"COUNTIF(D14:D15, TRUE)","v":0},{"$f":"G14>1","v":false},{"$f":"AND(D14,H$14)","v":false}]
[null,3,"Height adjustable non-Factory Trim coil springs, leaf springs, or torsion bars (or springs with modified factory height adjustment)",false,false,0,null,null,{"$f":"AND(D15,H$14)","v":false}]
[null,1,"Torsion bar to coil spring conversion",false,false,0]
[null,1,"Non-Factory Trim sway bars",false,false,0]
[null,1,"Non-Factory Trim engine bracing (not including motor and other drivetrain mounts)",false,false,0]
[null,1,"Non-Factory Trim/Modified Control Arms or Non-Factory Trim/Modified Trailing or Camber Arms of different dimensions than Factory Trim",false,false,0]
[null,2,"Modification of wishbone suspension upright",false,false,0]
[null,1,"Non-Factory Trim subframe that does not alter suspension geometry",false,false,0]
[null,1,"Non-Factory Trim/modified Watts Link",false,false,0]
[null,1,"Non-Factory Trim/modified panhard bar",false,false,0]
[null,2,"Non-Factory Trim torque bar",false,false,0,{"$f":"COUNTIF(D24:D25, TRUE)","v":0},{"$f":"G24>1","v":false},{"$f":"AND(D24,H$24)","v":false}]
[null,1,"Modify OEM torque bar",false,false,0,null,null,{"$f":"AND(D25,H$24)","v":false}]
[null,1,"Non-Factory Trim suspension bushings or spherical bearings, except rubber or polyurethane",false,false,0,null,null,false]
[null,1,"Non-Factory Trim/modified suspension components which enable alignment settings beyond Factory Trim capability (does not apply to coil springs, leaf springs, or torsion bars); note - additional points may need to be taken for specific non-Factory Trim suspension components if listed elsewhere in this section",false,false,0,null,null,false]
[null,0,"Non-Factory Trim bracing, including strut/shock tower brace, chassis brace(s) (e.g. X-brace or cross-bar)",false,false,0,null,null,false]
[null,0,"Custom Alignment settings, including caster, camber, or toe, regardless of factory recommendations; note: modifications to Factory-trim suspension components for the purposes of alignment adjustment must be assessed separately",false,false,0,null,null,false]
[null,0,"Non-Factory Trim suspension bushings, either rubber or polyurethane",false,false,0,null,null,false]
[null,0,"Non-Factory Trim suspension bushing limiters of any material; note - points must also be taken for bushing material, if applicable",false,false,0,null,null,false]
[null,0,"Removal of swaybars",false,false,0,null,null,false]
[null,0,"Non-Factory Trim sway bar endlinks",false,false,0,null,null,false]
[null,0,"Non-Factory Trim eccentric camber bolts",false,false,0,null,null,false]
[null,0,"Non-Factory Trim camber adjusting ball joints",false,false,0,null,null,false]
[null,0,"Modified steering rack from power assist to manual or manual to power assist  ",false,false,0,null,null,false]
[null,0,"Suspension re-enforcement provided by installation of roll bar or roll cage that adheres to requirements listed in the Car Requirements section of the rules",false,false,0,null,null,false]
[null,0,"Disabling or enabling of Factory Trim Electronic Stability Control systems",false,false,0,null,null,false]
["Total",{"$f":"IF(G8, \"Select Error\", SUM(F9:F38))","v":0}]
[]
["Total Suspension Modifications Assessment",{"$f":"Total","v":0}]
[]
["Go to previous sheet (Drivetrain)","Go to next sheet (Brakes)"]

{"sheet":"Brakes","index":6,"n_rows":24,"n_cols":9,"rows_kept":24,"cut":false,"hidden":false,"merged":[[0,0,0,2]]}
[{"$f":"CONCATENATE(Title, \" \", Version)","v":"COMSCC 2024 v12.0"}]
[]
["Touring Class Summary"]
[]
["Brakes Modifications Worksheet"]
["Click \"Select\" where appropriate"]
[]
["Select or TRUE","Assessment","Description"]
[null,1,"Non‐Factory Trim brake calipers, drums, and/or rotors of a different size ‐ front, rear or both",{"$f":"OR(E9,A9)","v":false},false,{"$f":"IF(D9, B9, 0)","v":0},null,null,false]
[null,2,"Non-Factory Trim/modified ABS (e.g. Bosch Motorsport ABS)",{"$f":"OR(E10,A10)","v":false},false,{"$f":"IF(D10, B10, 0)","v":0},{"$f":"COUNTIF(D10:D11, TRUE)","v":0},{"$f":"G10>1","v":false},{"$f":"AND(D10,H$10)","v":false}]
[null,-1,"Disabling any and all factory and/or aftermarket ABS or competing in a vehicle not originally equipped with ABS",{"$f":"OR(E11,A11)","v":false},false,{"$f":"IF(D11, B11, 0)","v":0},null,null,{"$f":"AND(D11,H$10)","v":false}]
[null,0,"Non-Factory Trim rotors of the same type and shape as OEM",false,false,0,null,null,false]
[null,0,"Non-Factory Trim rotors of the same thickness and diameter as Factory Trim, including swap from one-piece to two-piece rotors",false,false,0,null,null,false]
[null,0,"Non-Factory Trim brake pads or shoes",false,false,0,null,null,false]
[null,0,"Non-Factory Trim/modified brake lines",false,false,0,null,null,false]
[null,0,"Non-Factory Trim/modified brake ducting",false,false,0,null,null,false]
[null,0,"Enabling or use of Factory Trim ABS",false,false,0,null,null,false]
[null,0,"Non-Factory Trim drilled or slotted rotors of the same shape and size as OEM",false,false,0,null,null,false]
[null,0,"Modified, re-located, or non-Factory Trim brake brakets",false,false,0,null,null,false]
["Total",{"$f":"SUM(F9:F19)","v":0}]
[]
["Total Brakes Modifications Assessment",{"$f":"Total","v":0}]
[]
["Go to previous sheet (Suspension)","Go to next sheet (Exterior)"]

{"sheet":"Exterior","index":7,"n_rows":38,"n_cols":9,"rows_kept":38,"cut":false,"hidden":false,"merged":[[0,0,0,2]]}
[{"$f":"CONCATENATE(Title, \" \", Version)","v":"COMSCC 2024 v12.0"}]
[]
["Touring Class Summary"]
[]
["Exterior Modifications Worksheet"]
["Click \"Select\" where appropriate and enter information in the yellow cells…"]
[]
["Select or TRUE","Assessment","Description",null,null,null,{"$f":"IF(H8>0, TRUE, FALSE)","v":false},{"$f":"COUNTIF(H9:H21, TRUE)","v":0}]
[null,1,"Non-Factory Trim/modified front bumper/air dam/spoiler",false,false,{"$f":"IF(D9, B9, 0)","v":0}]
[null,1,"Non-Factory Trim/modified front splitter, in addition to bumper/air dam/spoiler",{"$f":"OR(E10,A10)","v":false},false,{"$f":"IF(D10, B10, 0)","v":0},{"$f":"COUNTIF(D10:D11, TRUE)","v":0},{"$f":"G10>1","v":false},{"$f":"AND(D10,H$10)","v":false}]
[null,2,"Non-Factory Trim/modified front splitter that extends more than 3.5 inches from front bumper skin leading edge, in addition to bumper/air dam/spoiler",false,false,0,null,null,{"$f":"AND(D11,H$10)","v":false}]
[null,1,"Non-Factory Trim/modified canards (each set assessed points front or rear)",false,false,0]
[null,1,"Non-Factory Trim Rear spoiler or wing including any airfoil that in no way protrudes more than 6” from the mounting location of the spoiler or wing, does not exceed the height of the vehicle, and does not extend beyond the width of the rear quarter panels",false,false,0,{"$f":"COUNTIF(D13:D15, TRUE)","v":0},{"$f":"G13>1","v":false},{"$f":"AND(D13,H$13)","v":false}]
[null,2,"Non-Factory Trim Rear spoiler or wing including any airfoil that does not exceed the height of the vehicle, does not extend beyond the width of the rear quarter panels, and does not extend no more than 6\" beyond the skin of the rear bumper",false,false,0,{"$f":"COUNTIF(D14:D15, TRUE)","v":0},null,{"$f":"AND(D14,H$13)","v":false}]
[null,3,"Non-Factory Trim Rear spoiler or wing including any air foil of any size or shape",false,false,0,null,null,{"$f":"AND(D15,H$13)","v":false}]
[null,1,"Non-Factory Trim hardtop of different shape and size which alters airflow aft of the OEM rear glass (eg CWest Honda S2000 aero hardtop)",false,false,0,{"$f":"COUNTIF(D16:D17, TRUE)","v":0},{"$f":"G16>1","v":false},{"$f":"AND(D16,H$16)","v":false}]
[null,0,"Factory trim hardtop or Non-Factory Trim hardtop of the same shape and size of OEM hardtop ",false,false,0,null,null,{"$f":"AND(D17,H$16)","v":false}]
[null,1,"Non-Factory Trim/modified vortex generator to roof, hardtop, rear glass or trunk",false,false,0]
[null,2,"Non-Factory Trim/modified flat bottom",false,false,0]
[null,2,"Non-Factory Trim/modified rear diffuser",false,false,0]
[null,1,"Non-Factory Trim/modified side skirts",false,false,0]
[null,4,"Non-factory trim Active aero, i.e. moveable aero devices; points assessed for each piece, in addition to assessment points listed above",false,false,0]
[null,0,"Front Underbody Tray that does not extend in front of the front bumper skin, beyond the width of the front quarter panels, or more than 18\" behind the front axle; note – points for front splitter, bumper, spoiler, air dam, and flat bottom assessed separately",false,false,0]
[null,0,"Non-Factory Trim/modified fenders",false,false,0]
[null,0,"Non-Factory Trim/modified doors",false,false,0]
[null,0,"Non-Factory Trim/modified trunk lid",false,false,0]
[null,0,"Non-Factory Trim/modified rear bumper",false,false,0]
[null,0,"Non-Factory Trim/modified hood",false,false,0]
[null,-1,"1 COM supplied sticker on each side of the vehicle that is easily visible from the outside (2 stickers minimum)",false,false,0]
["Total",{"$f":"IF(G8, \"Select Error\", SUM(F9:F29))","v":0},null,null,null,0]
[null,null,null,null,null,0]
["Number of Pieces","Assessment","Description",null,null,0]
[null,{"$f":"A33*4","v":0},"Non-factory trim Active aero, i.e. moveable aero devices; 4 points assessed for each piece, in addition to assessment points listed above"]
[]
[]
["Total Exterior Modifications Assessment",{"$f":"SUM(B33,Total)","v":0}]
[]
["Go to previous sheet (Brakes)","Go to next sheet (Weight Reduction"]

{"sheet":"Weight","index":8,"n_rows":40,"n_cols":7,"rows_kept":40,"cut":false,"hidden":false,"merged":[[0,0,0,2],[33,0,38,2]]}
[{"$f":"CONCATENATE(Title, \" \", Version)","v":"COMSCC 2024 v12.0"}]
[]
["Touring Class Summary"]
[null,null,null,"Full,7/8,3/4,2/3,1/2",null,"Full",1]
["Weight Reduction Worksheet",null,null,null,null,"7/8",{"$f":"7/8","v":0.875}]
["Enter weight in the yellow cell",null,null,null,null,"3/4",0.75]
[null,null,null,null,null,"2/3",{"$f":"2/3","v":0.66666666666666663}]
["Weight Type","Amount","Description",null,null,"5/8",{"$f":"5/8","v":0.625}]
["Showroom Base Weight",{"$f":"Car_Base_Weight","v":""},"Factory listed curb weight for a production vehicle, see Showroom Assessment Car List for amount (from Car List)",null,null,"1/2",0.5]
["Competition Weight",null,"Total weight of vehicle plus fluids, driver, ballast and any and all safety and other equipment during competition",null,null,"3/8",{"$f":"3/8","v":0.375}]
["Weight Difference",{"$f":"IF(B10, B10-B9, 0)","v":0},null,null,null,"1/3",{"$f":"1/3","v":0.33333333333333331}]
[null,null,null,null,null,"1/4",0.25]
["Weight Reduction Assessment",{"$f":"IF(ISNUMBER(Competition_Weight),INT(((Competition_Weight/(2/3*Factory_Rated_HP+1/3*Factory_Rated_Torque))*-4.25+112+INDEX(Selected_Vehicle,12)-Showroom_Assessment_Points)*100)/100, \"Enter Weight\")","v":"Enter Weight"},null,null,null,"1/8",{"$f":"1/8","v":0.125}]
[null,null,null,null,null,"Empty",0]
[]
["Ballast Record"]
["Indicate the fuel level and ballast for steward inspection purposes as included in your competition weight"]
["Item","Value","Description",null,null,"Gasoline",6.2]
["Ballast Amount (lbs)",null,"Additional ballast added to vehicle, if any (weight plates etc)",null,null,"Diesel",7.1]
["Ballast Location",null,"Location of ballast (passenger, trunk, back seat etc)",{"$f":"ISBLANK(BallastLocation)","v":true}]
["Fuel Type","Gasoline","Select fuel type used",null,{"$f":"VLOOKUP(B21,F18:G19,2, FALSE)","v":6.2}]
["Fuel Level","1/2","Indicated Fuel Level",null,{"$f":"VLOOKUP(B22,FuelLevelTable, 2, FALSE)","v":0.5}]
["Fuel Capacity (Gal.)",null,"Fuel Tank Capacity when full"]
["Approx Fuel Weight",{"$f":"B23*FuelAmount*PoundsPerGallon","v":0}]
[]
["Steward Use Only"]
["Fuel Level","1/2","Tech Fuel Level",null,{"$f":"VLOOKUP(B27,FuelLevelTable, 2, FALSE)","v":0.5}]
["Fuel Weight Difference",{"$f":"(B23*E27*PoundsPerGallon)-(B23*FuelAmount*PoundsPerGallon)","v":0}]
[]
["Note – weight reduction can be achieved by removing or replacing any non-essential parts, unless otherwise mentioned"]
["Parts include: interior headliner, seats, carpets, insulation, air conditioner, radio, sunroof/moonroof, spare tire, jack, interior panels, console, etc. "]
["Ballast is allowed up to 150lbs provided it is secured – location and security of ballast must be verified by Tech Inspector or a Steward"]
[]
["A COMSCC Steward may choose to have a competitor’s car weighed at any time during an event where scales are available.  Further, the Steward may choose to weigh a single competitor, a group of competitors, an entire class or run group, or the entire Time Trial field.  Scale readouts may either be used for informational purposes or in the case of a protest or tech inspection.  COMSCC has it's own scales, and in case of a difference between your scales, scales at the track (NHMS), or your race shop's scales, ours win.  So leave yourself a reasonable margin of error if you're at the edge of your class limit- say 10 lbs or so."]
[]
[]
[]
[]
[]
["Go to previous sheet (Exterior)","Go to next sheet (Tires)"]

{"sheet":"Tires","index":9,"n_rows":93,"n_cols":14,"rows_kept":93,"cut":false,"hidden":false,"merged":[[0,0,0,2],[76,2,77,2]]}
[{"$f":"CONCATENATE(Title, \" \", Version)","v":"COMSCC 2024 v12.0"}]
[]
["Touring Class Summary"]
[]
["Tires Reduction Worksheet"]
["Select a tire and enter tire width information in the yellow cells…"]
["Note: Tire softening compounds are illegal in all Touring classes"]
["Select or TRUE","Assessment","Description",null,null,{"$f":"OFFSET(C9:C67, MATCH(TRUE, D9:D67, 0)-1, 0, 1, 1)","v":{"$error":"#N/A"}},{"$f":"IF(D68>1,TRUE,FALSE)","v":false}]
[null,15,"Non-DOT Slicks (except where noted)",false,false,{"$f":"IF(D9, B9, 0)","v":0},"O",null,{"$f":"AND(D9,$G$8)","v":false}]
[null,10,"BFGoodrich R1-S, g-force slick",false,false,{"$f":"IF(D10, B10, 0)","v":0},"O",null,{"$f":"AND(D10,$G$8)","v":false}]
[null,10,"Continental Challenge Wets",false,false,0,"O",null,false]
[null,10,"Goodyear RS AC - \"dot radial\"",false,false,0,"O",null,false]
[null,10,"Hankook c90, c91,C9, Wets",false,false,0,"O",null,false]
[null,10,"Hoosier Radial Wets, H2O,SMW",false,false,0,"O",null,false]
[null,10,"Hoosier A Compound (All)",false,false,0,"O",null,false]
[null,10,"Pirelli P-Zero Slick ( DH Compound ONLY)",false,false,0,"O",null,false]
[null,6,"Hankook c70, c71, C7",false,false,{"$f":"IF(D17, B17, 0)","v":0},"O",null,{"$f":"AND(D17,$G$8)","v":false}]
[null,6,"Yoko A055",false,false,{"$f":"IF(D18, B18, 0)","v":0},"O",null,{"$f":"AND(D18,$G$8)","v":false}]
[null,6,"Goodyear eagle RS",false,false,{"$f":"IF(D19, B19, 0)","v":0},"O",null,{"$f":"AND(D19,$G$8)","v":false}]
[null,6,"Hoosier R7, SM7, SM7.5 compound (All)",false,false,{"$f":"IF(D20, B20, 0)","v":0},"O",null,{"$f":"AND(D20,$G$8)","v":false}]
[null,6,"Kumho Ecsta V700",false,false,0,"O",null,false]
[null,6,"BFGoodrich R1",false,false,0,"O",null,false]
[null,6,"Hankook Z214 c50, c51, C5",false,false,0,"O",null,false]
[null,2.5,"Continental Challenge Dry Tires",false,false,0,"O",null,false]
[null,2.5,"Hankook Z221 TD Soft",false,false,0,"O",null,false]
[null,1.5,"VITOUR Tempesta P1",false,false,0,"O",null,false]
[null,1.5,"Goodyear Supercar 3R",false,false,0,"O",null,false]
[null,0,"DOT UTQG rating 41-120 (unclassified)",false,false,0,"O",null,false]
[null,0,"Federal FZ-201 Soft",false,false,{"$f":"IF(D29, B29, 0)","v":0},"O",null,{"$f":"AND(D29,$G$8)","v":false}]
[null,0,"Hankook z221 TD Hard/ C3",false,false,0,"O",null,false]
[null,0,"Maxxis Victra RC-1 (R2)",false,false,0,"O",null,false]
[null,0,"Pirelli Tropheo R",false,false,{"$f":"IF(D32, B32, 0)","v":0},"O",null,{"$f":"AND(D32,$G$8)","v":false}]
[null,-1,"Toyo Proxes RR",false,false,{"$f":"IF(D33, B33, 0)","v":0},"O",null,{"$f":"AND(D33,$G$8)","v":false}]
[null,-1.5,"Bridgestone RE71RS",false,false,0,"O",null,false]
[null,-1.5,"Yokahama A052",false,false,0,"O",null,false]
[null,-1.5,"DOT UTQG rating 121-200 (unclassified)",false,false,0,"O",null,false]
[null,-2.5,"BFGoodrich Rival S 1.5",false,false,0,"O",null,false]
[null,-2.5,"Bridgestone RE71R",false,false,0,"O",null,false]
[null,-2.5,"Falken Azenis RT660",false,false,{"$f":"IF(D39, B39, 0)","v":0},"O",null,{"$f":"AND(D39,$G$8)","v":false}]
[null,-2.5,"Federal FZ-201 Medium",false,false,{"$f":"IF(D40, B40, 0)","v":0},"O",null,{"$f":"AND(D40,$G$8)","v":false}]
[null,-2.5,"Yoko ADVAN Apex",false,false,{"$f":"IF(D41, B41, 0)","v":0},"O",null,{"$f":"AND(D41,$G$8)","v":false}]
[null,-2.5,"Kumho Ecsta V720, V730",false,false,{"$f":"IF(D42, B42, 0)","v":0},"O",null,{"$f":"AND(D42,$G$8)","v":false}]
[null,-2.5,"Michelin Pilot Sport Cup 2",false,false,{"$f":"IF(D43, B43, 0)","v":0},"O",null,{"$f":"AND(D43,$G$8)","v":false}]
[null,-2.5,"Michelin Sport Cup 2R",false,false,0,"O",null,false]
[null,-2.5,"Nankang AR-1",false,false,{"$f":"IF(D45, B45, 0)","v":0},"O",null,{"$f":"AND(D45,$G$8)","v":false}]
[null,-2.5,"Nankang CR-1",false,false,{"$f":"IF(D46, B46, 0)","v":0},"O",null,{"$f":"AND(D46,$G$8)","v":false}]
[null,-2.5,"Toyo R888",false,false,{"$f":"IF(D47, B47, 0)","v":0},"O",null,{"$f":"AND(D47,$G$8)","v":false}]
[null,-2.5,"Toyo RA1",false,false,{"$f":"IF(D48, B48, 0)","v":0},"O",null,{"$f":"AND(D48,$G$8)","v":false}]
[null,-2.5,"Yokahama A048",false,false,{"$f":"IF(D49, B49, 0)","v":0},"O",null,{"$f":"AND(D49,$G$8)","v":false}]
[null,-3.5,"R888R",false,false,0,"O",null,false]
[null,-3.5,"Dunlop Direzza ZIII",false,false,{"$f":"IF(D51, B51, 0)","v":0},"O",null,{"$f":"AND(D51,$G$8)","v":false}]
[null,-3.5,"Nitto NT01",false,false,{"$f":"IF(D52, B52, 0)","v":0},"O",null,{"$f":"AND(D52,$G$8)","v":false}]
[null,-3.5,"Federal 595RS-RR, PRO",false,false,0,"O",null,false]
[null,-3.5,"Goodyear Supercar 3",false,false,0,"O",null,false]
[null,-3.5,"Goodyear Supercar G:2",false,false,0,"O",null,false,null,null,null,"Class","Spec size"]
[null,-3.5,"Toyo R1R",false,false,{"$f":"IF(D56, B56, 0)","v":0},"O",null,{"$f":"AND(D56,$G$8)","v":false},null,null,null,"T30",185]
[null,-5,"BF Goodrich g-Force Rival",false,false,{"$f":"IF(D57, B57, 0)","v":0},"O",null,{"$f":"AND(D57,$G$8)","v":false},null,null,null,"T40",205]
[null,-5,"Continental ExtremeContact Force",false,false,0,"O",null,false,null,null,null,"T50",225]
[null,-5,"Falken Azenis RT615K+",false,false,{"$f":"IF(D59, B59, 0)","v":0},"O",null,{"$f":"AND(D59,$G$8)","v":false},null,null,null,"T60",245]
[null,-5,"Hankook Ventus RS-4",false,false,0,"O",null,false,null,null,null,"T70",265]
[null,-5,"Maxxis Victra VR-1",false,false,{"$f":"IF(D61, B61, 0)","v":0},"O",null,{"$f":"AND(D61,$G$8)","v":false},null,null,null,"T80",285]
[null,-7,"DOT UTQG rating 201-280",false,false,0,"O",null,false,null,null,null,"T90",305]
[null,-7,"Cooper RS3-R",false,false,0,"O",null,false,null,null,null,"T100",315]
[null,-7,"Cooper RS3-RS",false,false,0,"O",null,false]
[null,-7,"Federal 595RS-R",false,false,{"$f":"IF(D65, B65, 0)","v":0},"O",null,{"$f":"AND(D65,$G$8)","v":false}]
[null,-7,"Michelin Pilot Super Sport, Pilot Spt 4S",false,false,{"$f":"IF(D66, B66, 0)","v":0},"O",null,{"$f":"AND(D66,$G$8)","v":false}]
[null,-10,"DOT UTQG rating > 281",false,false,0,"O",null,false]
[null,{"$f":"IF(D68=0, \"Pick one above\", IF(G8, \"Error multi-select\",SUM(F9:F67)))","v":"Pick one above"},null,{"$f":"COUNTIF(D9:D67, TRUE)","v":0},null,null,{"$f":"IF(D68>0, OFFSET(G9:G67, MATCH(TRUE, E9:E67, 0)-1, 0, 1, 1), \"Z\")","v":"Z"}]
[]
[{"$f":"IF(Competition_class=\"T110\",\"Note: The sheet says T110 here to make it work, your proposed class is actually TU\",\"\")","v":""}]
["Proposed Class",{"$f":"Classification","v":""},{"$f":"Total_Assessment","v":"No Vehicle"},{"$f":"HLOOKUP(Tire_Competition_Class, Tire_Class_Width, 2, FALSE)","v":{"$error":"#N/A"}},null,null,10]
["Intended Competition Class",null,{"$f":"IF(ISNUMBER(Tire_spec_width), CONCATENATE(\"Class spec width \", Tire_spec_width, \" mm\"),\"Select intended competition class\")","v":"Select intended competition class"},null,null,null,10]
["Tire Width Front",null,"Tire width in mm",null,null,235,15]
["Brand",null,"Note - some tires are assessed 1 point for \nexcess tire-width relative to listed tire size"]
["Difference"]
["Tire Width Rear",null,"Tire width in mm",null,null,275,20]
["Average Width",{"$f":"IF(ISNUMBER(AVERAGE(B73,B76)),AVERAGE(B73,B76),\"Enter Width\")","v":"Enter Width"},{"$f":"IF(G77, \"Warning: Selected tire class higher than current assessment\", \"\")","v":""},{"$f":"Tire_Width-D71","v":{"$error":"#VALUE!"}},{"$f":"D77*0.05","v":{"$error":"#VALUE!"}},null,{"$f":"IF(ISBLANK(Tire_Competition_Class),FALSE,IF(HLOOKUP(Tire_Competition_Class, Tire_Class_Width, 2, FALSE)>HLOOKUP(Competition_class, Tire_Class_Width, 2, FALSE),TRUE,FALSE))","v":false}]
["Assessment",{"$f":"IF(ISBLANK(Tire_Competition_Class),\"No Tire\",IF(ISNUMBER(E77),E77,\"No Width\"))","v":"No Tire"}]
[]
["Total Tire Assessment",{"$f":"IF(AND(ISNUMBER(Tire_Type_Assessment),ISNUMBER(Tire_Width_Assessment)),Tire_Type_Assessment+Tire_Width_Assessment,\"No Tire\")","v":"No Tire"}]
[null,null,null,null,null,null,null,null,{"$f":"SUM(I88:I93)","v":{"$error":"#N/A"}}]
["Go to previous sheet (Weight Reduction)","See Results (Touring Summary)"]
[]
[]
[null,null,"T110","T100","T90","T80","T70","T60","T50","T40","T30"]
[null,null,335,315,305,285,265,245,225,205,185]
[]
[null,null,null,null,null,null,{"$f":"IF(Tire_Width<Tire_spec_width, MIN(0, Tire_Width - MIN(Size_235, Tire_spec_width)), 0)","v":{"$error":"#N/A"}},{"$f":"per_10","v":10},{"$f":"IF(G88<0, G88/H88, 0)","v":{"$error":"#N/A"}}]
[null,null,null,null,null,null,{"$f":"IF(Tire_Width<Tire_spec_width, MIN(0, MAX(Tire_Width,Size_235)-MIN(Tire_spec_width,Size_275)), 0)","v":{"$error":"#N/A"}},{"$f":"per_15","v":15},{"$f":"IF(G89<0, G89/H89, 0)","v":{"$error":"#N/A"}}]
[null,null,null,null,null,null,{"$f":"IF(Tire_Width<Tire_spec_width, MIN(0, MAX(Tire_Width,Size_275)-Tire_spec_width), 0)","v":{"$error":"#N/A"}},{"$f":"per_20","v":20},{"$f":"IF(G90<0, G90/H90, 0)","v":{"$error":"#N/A"}}]
[null,null,null,null,null,null,{"$f":"IF(Tire_Width>Tire_spec_width, MIN(Tire_Width,Size_235)-Tire_spec_width, 0)","v":{"$error":"#N/A"}},{"$f":"per_10","v":10},{"$f":"IF(G91>0, G91/H91, 0)","v":{"$error":"#N/A"}}]
[null,null,null,null,null,null,{"$f":"IF(Tire_Width>Tire_spec_width, MIN(Tire_Width,Size_275)-MAX(Tire_spec_width,Size_235), 0)","v":{"$error":"#N/A"}},{"$f":"per_15","v":15},{"$f":"IF(G92>0, G92/H92, 0)","v":{"$error":"#N/A"}}]
[null,null,null,null,null,null,{"$f":"IF(AND(Tire_Width>Tire_spec_width,Tire_Width>Size_275), Tire_Width-MAX(Tire_spec_width,Size_275), 0)","v":{"$error":"#N/A"}},{"$f":"per_20","v":20},{"$f":"IF(G93>0, G93/H93, 0)","v":{"$error":"#N/A"}}]

{"sheet":"not used","index":10,"n_rows":100,"n_cols":15,"rows_kept":100,"cut":false,"hidden":true,"merged":[[72,14,73,14],[79,14,80,14],[81,14,82,14],[86,14,87,14],[90,14,91,14],[92,14,93,14],[46,12,47,12],[49,12,50,12],[58,12,59,12],[60,12,61,12],[69,12,70,12],[49,14,50,14],[52,14,53,14],[61,14,62,14],[67,14,68,14],[69,14,70,14],[0,1,0,9],[3,0,3,4],[3,6,3,10],[5,0,5,4],[11,0,11,4],[11,6,11,10],[7,6,7,8],[8,6,8,8],[9,6,9,8],[5,6,5,7],[7,9,7,10],[8,9,8,10],[9,9,9,10],[5,9,5,10],[7,0,9,4],[10,6,10,8],[10,9,10,10],[26,7,26,8],[26,9,26,10],[12,6,12,8],[13,6,13,8],[12,9,12,10],[13,9,13,10],[14,9,14,10],[14,6,14,8],[24,0,24,2],[24,9,24,10],[24,6,24,8],[25,7,25,8],[25,9,25,10],[16,6,16,8],[16,9,16,10],[12,0,12,2],[14,0,14,2],[16,0,16,2],[18,0,18,2],[20,0,20,2],[22,0,22,2],[26,0,26,2],[17,9,17,10],[17,6,17,8],[49,0,50,0],[46,0,47,0],[38,0,38,2],[38,4,38,6],[38,8,38,9],[29,0,29,4],[30,3,30,4],[29,6,29,10],[30,6,30,7],[37,0,37,2],[37,4,37,6],[37,8,37,9],[46,1,47,4],[48,1,48,4],[49,1,50,4],[46,7,46,10],[47,7,47,10],[48,7,48,10],[45,1,45,2],[40,0,41,4],[69,0,70,0],[60,0,61,0],[58,0,59,0],[69,1,70,4],[73,1,73,4],[72,1,72,4],[71,1,71,4],[60,1,61,4],[90,1,90,4],[84,1,84,4],[85,1,85,4],[86,1,86,4],[87,1,87,4],[64,1,64,4],[57,1,57,4],[58,1,59,4],[62,1,62,4],[63,1,63,4],[82,1,82,4],[83,1,83,4],[97,1,97,4],[51,1,51,4],[52,1,52,4],[53,1,53,4],[54,1,54,4],[55,1,55,4],[56,1,56,4],[65,1,65,4],[91,1,91,4],[92,1,92,4],[96,1,96,4],[93,1,93,4],[66,1,66,4],[67,1,67,4],[68,1,68,4],[95,1,95,4],[89,1,89,4],[79,7,80,10],[74,7,74,10],[75,7,75,10],[76,7,76,10],[77,7,77,10],[78,7,78,10],[71,7,71,10],[88,1,88,4],[77,1,77,4],[75,1,75,4],[74,1,74,4],[55,7,55,10],[67,7,68,10],[69,7,70,10],[64,7,64,10],[61,7,62,10],[65,7,65,10],[66,7,66,10],[59,7,59,10],[60,7,60,10],[63,7,63,10],[98,7,98,10],[99,7,99,10],[81,7,82,10],[81,6,82,6],[88,7,88,10],[85,7,85,10],[84,7,84,10],[86,6,87,6],[90,6,91,6],[96,7,96,10],[97,7,97,10],[94,7,94,10],[95,7,95,10],[92,6,93,6],[89,7,89,10],[86,7,87,10],[90,7,91,10],[92,7,93,10],[18,6,18,8],[18,9,18,10],[19,6,19,8],[20,6,20,8],[19,9,19,10],[20,9,20,10],[79,1,79,4],[80,1,80,4],[78,1,78,4],[76,1,76,4],[67,6,68,6],[61,6,62,6],[52,6,53,6],[49,6,50,6],[79,6,80,6],[69,6,70,6],[72,6,73,6],[72,7,73,10],[56,7,56,10],[58,7,58,10],[49,7,50,10],[52,7,53,10],[51,7,51,10],[54,7,54,10]]}
["Home","COMSCC 2019 Touring Class Classification Sheet"]
[]
["Make",null,null,null,null,null,"Model"]
[{"$f":"Car_Make","v":""},null,null,null,null,null,{"$f":"Car_Model","v":""}]
["Year",null,null,null,null,null,"Showroom Assessment",null,null,"Class"]
[{"$f":"INDEX(Selected_Vehicle,3) &\" - \" & INDEX(Selected_Vehicle,4)","v":" - "},null,null,null,null,null,{"$f":"TEXT(Car_Base_Points,\"0.0\")","v":""},null,null,{"$f":"Car_Base_Class","v":""}]
[]
[{"$f":"IF(Safety_mods,\"Safety Upgrades Required for vehicles with 31+ modification points\",IF(Safety_Engine,\"Safety Upgrades Required for vehicles with 16+ engine modification points\",\"\"))","v":""},null,null,null,null,null,"Factory Rated Crank HP",null,null,{"$f":"Factory_Rated_HP","v":""}]
[null,null,null,null,null,null,"Factory Rated Torque",null,null,{"$f":"Factory_Rated_Torque","v":""}]
[null,null,null,null,null,null,"Showroom Base Weight",null,null,{"$f":"Showroom_Base_Weight","v":""}]
[null,null,null,null,null,null,"Competition Weight",null,null,{"$f":"Competition_Weight","v":0}]
["Modification Assessment Points"]
["Engine total",null,null,null,{"$f":"Total_Engine","v":0},null,{"$f":"IF(ISNUMBER(Scrutineer_Engine_Points), \"Scrutineer Engine Points\", \"\")","v":""},null,null,{"$f":"IF(ISNUMBER(Scrutineer_Engine_Points), Scrutineer_Engine_Points, \"\")","v":""}]
[null,null,null,null,null,null,{"$f":"IF(ISNUMBER(Scrutineer_Engine_Points), \"Scrutineer HP/Torque\", \"\")","v":""},null,null,{"$f":"IF(ISNUMBER(Scrutineer_Engine_Points), Scrutineer_HP & \"/\" & Scrutineer_Torque & \" \" & Engine_power_type, \"\")","v":""}]
["Drivetrain",null,null,null,{"$f":"Total_Drivetrain","v":0},null,{"$f":"IF(ISNUMBER(Scrutineer_Engine_Points), \"Dyno Type\", \"\")","v":""},null,null,{"$f":"IF(ISNUMBER(Scrutineer_Engine_Points), Drivetrain_type, \"\")","v":""}]
[]
["Suspension",null,null,null,{"$f":"Total_Suspension","v":0},null,"Current Weight",null,null,{"$f":"TEXT(Weight_Difference,\"0\") & IF(Weight_Difference > 0, \" over\", \" under\")","v":"0 under"}]
[null,null,null,null,null,null,{"$f":"Weight!A19","v":"Ballast Amount (lbs)"},null,null,{"$f":"BallastAmount","v":0}]
["Brakes",null,null,null,{"$f":"Total_Brakes","v":0},null,{"$f":"Weight!A20","v":"Ballast Location"},null,null,{"$f":"BallastLocation","v":0}]
[null,null,null,null,null,null,"Fuel Level",null,null,{"$f":"BallastFuelLevel","v":"1/2"}]
["Exterior",null,null,null,{"$f":"Total_Exterior","v":0}]
[]
["Weight Reduction",null,null,null,{"$f":"Total_Weight","v":"Enter Weight"}]
[]
["Tire total",null,null,null,{"$f":"Total_Tire","v":"No Tire"},null,"Tire Compound",null,null,{"$f":"Tire_Compound","v":{"$error":"#N/A"}}]
[null,null,null,null,null,null,null,"Avg Tire Width",null,{"$f":"Tire_Width","v":"Enter Width"}]
["All mods total",null,null,null,{"$f":"Points_Assessment","v":0},null,null,"Spec Width",null,{"$f":"Tire_spec_width","v":{"$error":"#N/A"}}]
[]
[]
["Total Assessment Points",null,null,null,null,null,"Touring Car Class"]
[null,null,null,{"$f":"TEXT(Total_Assessment,\"0.0\")","v":"No Vehicle"},null,null,{"$f":"TEXT(Touring_Class,\"0.0\")","v":"Tire Class Not Set"}]
[]
["Note: All convertibles and open cockpit cars must have a suitable roll bar and arm-restraints (see rules for info)"]
[]
[]
["Driver Information"]
[]
[]
["First Name",null,null,null,"Last Name",null,null,null,"Car Number"]
[]
[]
[]
["Competitor Signature"]
["By signing this form I attest to the accuracy and completeness of the information provided on this sheet"]
[]
[null,"Engine",null,null,null,null,null,"Drivetrain",null,null,null,null,"Engine",null,"Drivetrain"]
[{"$f":"INDEX(Public_Engine_Mods, 1, 2)","v":1},{"$f":"INDEX(Public_Engine_Mods, 1, 3)","v":"Reprogrammed Factory Trim (includes ROM chips) ECU, naturally aspirated engine"},null,null,null,null,{"$f":"INDEX(Public_Drivetrain_Mods, 1, 2)","v":6},{"$f":"INDEX(Public_Drivetrain_Mods, 1, 3)","v":"Non-Factory Trim sequential gearbox"},null,null,null,null,{"$f":"INDEX(Public_Engine_Mods, 1, 4)","v":false},null,{"$f":"INDEX(Public_Drivetrain_Mods, 1, 4)","v":false}]
[null,null,null,null,null,null,{"$f":"INDEX(Public_Drivetrain_Mods, 2, 2)","v":4},{"$f":"INDEX(Public_Drivetrain_Mods, 2, 3)","v":"Non-Factory Trim non-sequential (H pattern) Dogbox gearbox"},null,null,null,null,null,null,{"$f":"INDEX(Public_Drivetrain_Mods, 2, 4)","v":false}]
[{"$f":"INDEX(Public_Engine_Mods, 2, 2)","v":2},{"$f":"INDEX(Public_Engine_Mods, 2, 3)","v":"Non-Factory Trim ECU, naturally aspirated engine"},null,null,null,null,{"$f":"INDEX(Public_Drivetrain_Mods, 3, 2)","v":3},{"$f":"INDEX(Public_Drivetrain_Mods, 3, 3)","v":"Dual clutch transmission - DSG, DCT, PDK, etc"},null,null,null,null,{"$f":"INDEX(Public_Engine_Mods, 2, 4)","v":false},null,{"$f":"INDEX(Public_Drivetrain_Mods, 3, 4)","v":false}]
[{"$f":"INDEX(Public_Engine_Mods, 3, 2)","v":3},{"$f":"INDEX(Public_Engine_Mods, 3, 3)","v":"Reprogrammed Factory Trim (includes ROM chips) ECU, forced induction engine air/fuel change only. If applicable, additional points must be added for an increase in boost."},null,null,null,null,{"$f":"INDEX(Public_Drivetrain_Mods, 5, 2)","v":1},{"$f":"INDEX(Public_Drivetrain_Mods, 5, 3)","v":"Automated single clutch manual transmission - SMG, Ferrari F1, Lambo E-Gear etc"},null,null,null,null,{"$f":"INDEX(Public_Engine_Mods, 3, 4)","v":false},null,{"$f":"INDEX(Public_Drivetrain_Mods, 5, 4)","v":false}]
[]
[{"$f":"INDEX(Public_Engine_Mods, 4, 2)","v":4},{"$f":"INDEX(Public_Engine_Mods, 4, 3)","v":"Non-Factory Trim ECU, forced induction engine engine air/fuel change only. If applicable, additional points must be added for an increase in boost."},null,null,null,null,{"$f":"INDEX(Public_Drivetrain_Mods, 6, 2)","v":1},{"$f":"INDEX(Public_Drivetrain_Mods, 6, 3)","v":"Manual tranmission with factory autoblip (Nissan 370Z, BMW M2, C7 Corvette, Porsche) or aftermarket add-on"},null,null,null,null,{"$f":"INDEX(Public_Engine_Mods, 4, 4)","v":false},null,{"$f":"INDEX(Public_Drivetrain_Mods, 6, 4)","v":false}]
[{"$f":"INDEX(Public_Engine_Mods, 5, 2)","v":2},{"$f":"INDEX(Public_Engine_Mods, 5, 3)","v":"Turbo Boost increase <50%"},null,null,null,null,{"$f":"INDEX(Public_Drivetrain_Mods, 7, 2)","v":0},{"$f":"INDEX(Public_Drivetrain_Mods, 7, 3)","v":"5 or 6 speed manual transmission"},null,null,null,null,{"$f":"INDEX(Public_Engine_Mods, 5, 4)","v":false},null,{"$f":"INDEX(Public_Drivetrain_Mods, 7, 4)","v":false}]
[{"$f":"INDEX(Public_Engine_Mods, 6, 2)","v":4},{"$f":"INDEX(Public_Engine_Mods, 6, 3)","v":"Turbo Boost increase >50%"},null,null,null,null,null,null,null,null,null,null,{"$f":"INDEX(Public_Engine_Mods, 6, 4)","v":false}]
[{"$f":"INDEX(Public_Engine_Mods, 7, 2)","v":1},{"$f":"INDEX(Public_Engine_Mods, 7, 3)","v":"Non-Factory Trim/modified air intake before the throttle body"},null,null,null,null,{"$f":"INDEX(Public_Drivetrain_Mods, 8, 2)","v":-1},{"$f":"INDEX(Public_Drivetrain_Mods, 8, 3)","v":"3 or 4 speed manual transmission"},null,null,null,null,{"$f":"INDEX(Public_Engine_Mods, 7, 4)","v":false},null,{"$f":"INDEX(Public_Drivetrain_Mods, 8, 4)","v":false}]
[{"$f":"INDEX(Public_Engine_Mods, 8, 2)","v":1},{"$f":"INDEX(Public_Engine_Mods, 8, 3)","v":"Non-factory trim/modified headlight to allow increased or cooler air flow to engine air intake, unless already taking one point for cold air intake."},null,null,null,null,{"$f":"INDEX(Public_Drivetrain_Mods, 9, 2)","v":-2},{"$f":"INDEX(Public_Drivetrain_Mods, 9, 3)","v":"Automatic transmission with 6 speeds or less"},null,null,null,null,{"$f":"INDEX(Public_Engine_Mods, 8, 4)","v":false},null,{"$f":"INDEX(Public_Drivetrain_Mods, 9, 4)","v":false}]
[{"$f":"INDEX(Public_Engine_Mods, 9, 2)","v":1},{"$f":"INDEX(Public_Engine_Mods, 9, 3)","v":"Non-Factory Trim/modified throttle body"},null,null,null,null,{"$f":"INDEX(Public_Drivetrain_Mods, 10, 2)","v":-2},{"$f":"INDEX(Public_Drivetrain_Mods, 10, 3)","v":"CVT Transmission"},null,null,null,null,{"$f":"INDEX(Public_Engine_Mods, 9, 4)","v":false},null,{"$f":"INDEX(Public_Drivetrain_Mods, 10, 4)","v":false}]
[{"$f":"INDEX(Public_Engine_Mods, 10, 2)","v":1},{"$f":"INDEX(Public_Engine_Mods, 10, 3)","v":"Non-Factory Trim/modified fuel delivery system, except fuel pump(s) (i.e. fuel injectors, fuel rails, fuel regulators)"},null,null,null,null,null,"Suspension",null,null,null,null,{"$f":"INDEX(Public_Engine_Mods, 10, 4)","v":false},null,"Suspension"]
[{"$f":"INDEX(Public_Engine_Mods, 11, 2)","v":1},{"$f":"INDEX(Public_Engine_Mods, 11, 3)","v":"Non-Factory Trim/modified intake manifold 1-6 cylinder engines, including manifold porting"},null,null,null,null,{"$f":"INDEX(Public_Suspension_Mods, 1, 2)","v":1},{"$f":"INDEX(Public_Suspension_Mods, 1, 3)","v":"Non-Factory Trim non-adjustable shocks, struts, dampers"},null,null,null,null,{"$f":"INDEX(Public_Engine_Mods, 11, 4)","v":false},null,{"$f":"INDEX(Public_Suspension_Mods, 1, 4)","v":false}]
[null,null,null,null,null,null,{"$f":"INDEX(Public_Suspension_Mods, 2, 2)","v":1},{"$f":"INDEX(Public_Suspension_Mods, 2, 3)","v":"Non-Factory Trim 1-way adjustable shocks, struts, dampers"},null,null,null,null,null,null,{"$f":"INDEX(Public_Suspension_Mods, 2, 4)","v":false}]
[{"$f":"INDEX(Public_Engine_Mods, 12, 2)","v":2},{"$f":"INDEX(Public_Engine_Mods, 12, 3)","v":"Non-Factory Trim/modified intake manifold 7-12 cylinder engines, including manifold porting"},null,null,null,null,{"$f":"INDEX(Public_Suspension_Mods, 3, 2)","v":2},{"$f":"INDEX(Public_Suspension_Mods, 3, 3)","v":"Non-Factory Trim 2-way adjustable shocks, struts, dampers"},null,null,null,null,{"$f":"INDEX(Public_Engine_Mods, 12, 4)","v":false},null,{"$f":"INDEX(Public_Suspension_Mods, 3, 4)","v":false}]
[null,null,null,null,null,null,{"$f":"INDEX(Public_Suspension_Mods, 4, 2)","v":3},{"$f":"INDEX(Public_Suspension_Mods, 4, 3)","v":"Non-Factory Trim 3-way (or more) adjustable shocks, struts, dampers"},null,null,null,null,null,null,{"$f":"INDEX(Public_Suspension_Mods, 4, 4)","v":false}]
[{"$f":"INDEX(Public_Engine_Mods, 13, 2)","v":3},{"$f":"INDEX(Public_Engine_Mods, 13, 3)","v":"Water-alcohol injection System"},null,null,null,null,null,null,null,null,null,null,{"$f":"INDEX(Public_Engine_Mods, 13, 4)","v":false}]
[{"$f":"INDEX(Public_Engine_Mods, 14, 2)","v":"Dyno"},{"$f":"INDEX(Public_Engine_Mods, 14, 3)","v":"Non-Factory Trim/modified supercharger or turbocharger, any location"},null,null,null,null,{"$f":"INDEX(Public_Suspension_Mods, 5, 2)","v":1},{"$f":"INDEX(Public_Suspension_Mods, 5, 3)","v":"Non-Factory Trim shocks, struts, dampers with piggyback canister or external remote canister – note: must also take points for shocks/struts/dampers as listed above"},null,null,null,null,{"$f":"INDEX(Public_Engine_Mods, 14, 4)","v":false},null,{"$f":"INDEX(Public_Suspension_Mods, 5, 4)","v":false}]
[{"$f":"INDEX(Public_Engine_Mods, 15, 2)","v":3},{"$f":"INDEX(Public_Engine_Mods, 15, 3)","v":"Non-Factory Trim/modified supercharger pulley"},null,null,null,null,{"$f":"INDEX(Public_Suspension_Mods, 6, 2)","v":2},{"$f":"INDEX(Public_Suspension_Mods, 6, 3)","v":"Non-adjustable non-Factory Trim coil springs, leaf springs, or torsion bars (or non-modified factory height adjustment)"},null,null,null,null,{"$f":"INDEX(Public_Engine_Mods, 15, 4)","v":false},null,{"$f":"INDEX(Public_Suspension_Mods, 6, 4)","v":false}]
[{"$f":"INDEX(Public_Engine_Mods, 16, 2)","v":3},{"$f":"INDEX(Public_Engine_Mods, 16, 3)","v":"Non-Factory Trim/modified boost controller or vacuum lines that control boost"},null,null,null,null,{"$f":"INDEX(Public_Suspension_Mods, 7, 2)","v":3},{"$f":"INDEX(Public_Suspension_Mods, 7, 3)","v":"Height adjustable non-Factory Trim coil springs, leaf springs, or torsion bars (or springs with modified factory height adjustment)"},null,null,null,null,{"$f":"INDEX(Public_Engine_Mods, 16, 4)","v":false},null,{"$f":"INDEX(Public_Suspension_Mods, 7, 4)","v":false}]
[{"$f":"INDEX(Public_Engine_Mods, 17, 2)","v":1},{"$f":"INDEX(Public_Engine_Mods, 17, 3)","v":"Non-Factory Trim/modified wastegate, wastegate actuator"},null,null,null,null,{"$f":"INDEX(Public_Suspension_Mods, 8, 2)","v":1},{"$f":"INDEX(Public_Suspension_Mods, 8, 3)","v":"Torsion bar to coil spring conversion"},null,null,null,null,{"$f":"INDEX(Public_Engine_Mods, 17, 4)","v":false},null,{"$f":"INDEX(Public_Suspension_Mods, 8, 4)","v":false}]
[{"$f":"INDEX(Public_Engine_Mods, 18, 2)","v":2},{"$f":"INDEX(Public_Engine_Mods, 18, 3)","v":"Non-Factory Trim/modified intercooler"},null,null,null,null,{"$f":"INDEX(Public_Suspension_Mods, 9, 2)","v":1},{"$f":"INDEX(Public_Suspension_Mods, 9, 3)","v":"Non-Factory Trim sway bars"},null,null,null,null,{"$f":"INDEX(Public_Engine_Mods, 18, 4)","v":false},null,{"$f":"INDEX(Public_Suspension_Mods, 9, 4)","v":false}]
[{"$f":"INDEX(Public_Engine_Mods, 19, 2)","v":1},{"$f":"INDEX(Public_Engine_Mods, 19, 3)","v":"Non-Factory Trim/modified intercooler pipes only"},null,null,null,null,null,null,null,null,null,null,{"$f":"INDEX(Public_Engine_Mods, 19, 4)","v":false}]
[{"$f":"INDEX(Public_Engine_Mods, 20, 2)","v":"Dyno"},{"$f":"INDEX(Public_Engine_Mods, 20, 3)","v":"Non-Factory Trim/modified camshafts, rocker arms, pushrods, or cam gears that adjust cam timing or lift"},null,null,null,null,{"$f":"INDEX(Public_Suspension_Mods, 10, 2)","v":1},{"$f":"INDEX(Public_Suspension_Mods, 10, 3)","v":"Non-Factory Trim engine bracing (not including motor and other drivetrain mounts)"},null,null,null,null,{"$f":"INDEX(Public_Engine_Mods, 20, 4)","v":false},null,{"$f":"INDEX(Public_Suspension_Mods, 10, 4)","v":false}]
[]
[{"$f":"INDEX(Public_Engine_Mods, 21, 2)","v":"Dyno"},{"$f":"INDEX(Public_Engine_Mods, 21, 3)","v":"Ported/polished Factory Trim cylinder heads"},null,null,null,null,{"$f":"INDEX(Public_Suspension_Mods, 11, 2)","v":1},{"$f":"INDEX(Public_Suspension_Mods, 11, 3)","v":"Non-Factory Trim/Modified Control Arms or Non-Factory Trim/Modified Trailing or Camber Arms of different dimensions than Factory Trim"},null,null,null,null,{"$f":"INDEX(Public_Engine_Mods, 21, 4)","v":false},null,{"$f":"INDEX(Public_Suspension_Mods, 11, 4)","v":false}]
[{"$f":"INDEX(Public_Engine_Mods, 22, 2)","v":"Dyno"},{"$f":"INDEX(Public_Engine_Mods, 22, 3)","v":"Non-Factory Trim cylinder heads"},null,null,null,null,{"$f":"INDEX(Public_Suspension_Mods, 12, 2)","v":2},{"$f":"INDEX(Public_Suspension_Mods, 12, 3)","v":"Modification of wishbone suspension upright"},null,null,null,null,{"$f":"INDEX(Public_Engine_Mods, 22, 4)","v":false},null,{"$f":"INDEX(Public_Suspension_Mods, 12, 4)","v":false}]
[{"$f":"INDEX(Public_Engine_Mods, 23, 2)","v":"Dyno"},{"$f":"INDEX(Public_Engine_Mods, 23, 3)","v":"Non-Factory Trim/modified engine intake/exhaust valves"},null,null,null,null,null,null,null,null,null,null,{"$f":"INDEX(Public_Engine_Mods, 23, 4)","v":false}]
[{"$f":"INDEX(Public_Engine_Mods, 24, 2)","v":"Dyno"},{"$f":"INDEX(Public_Engine_Mods, 24, 3)","v":"Increased displacement by more than 1%"},null,null,null,null,{"$f":"INDEX(Public_Suspension_Mods, 13, 2)","v":1},{"$f":"INDEX(Public_Suspension_Mods, 13, 3)","v":"Non-Factory Trim subframe that does not alter suspension geometry"},null,null,null,null,{"$f":"INDEX(Public_Engine_Mods, 24, 4)","v":false},null,{"$f":"INDEX(Public_Suspension_Mods, 13, 4)","v":false}]
[{"$f":"INDEX(Public_Engine_Mods, 25, 2)","v":0},{"$f":"INDEX(Public_Engine_Mods, 25, 3)","v":"Increase compression ratio by .50 or less"},null,null,null,null,{"$f":"INDEX(Public_Suspension_Mods, 14, 2)","v":1},{"$f":"INDEX(Public_Suspension_Mods, 14, 3)","v":"Non-Factory Trim/modified Watts Link"},null,null,null,null,{"$f":"INDEX(Public_Engine_Mods, 25, 4)","v":false},null,{"$f":"INDEX(Public_Suspension_Mods, 14, 4)","v":false}]
[{"$f":"INDEX(Public_Engine_Mods, 26, 2)","v":"Dyno"},{"$f":"INDEX(Public_Engine_Mods, 26, 3)","v":"Increase compression ratio greater than .50"},null,null,null,null,{"$f":"INDEX(Public_Suspension_Mods, 15, 2)","v":1},{"$f":"INDEX(Public_Suspension_Mods, 15, 3)","v":"Non-Factory Trim/modified panhard bar"},null,null,null,null,{"$f":"INDEX(Public_Engine_Mods, 26, 4)","v":false},null,{"$f":"INDEX(Public_Suspension_Mods, 15, 4)","v":false}]
[{"$f":"INDEX(Public_Engine_Mods, 27, 2)","v":1},{"$f":"INDEX(Public_Engine_Mods, 27, 3)","v":"Dry sump engine oil system"},null,null,null,null,{"$f":"INDEX(Public_Suspension_Mods, 16, 2)","v":2},{"$f":"INDEX(Public_Suspension_Mods, 16, 3)","v":"Non-Factory Trim torque bar"},null,null,null,null,{"$f":"INDEX(Public_Engine_Mods, 27, 4)","v":false},null,{"$f":"INDEX(Public_Suspension_Mods, 16, 4)","v":false}]
[{"$f":"INDEX(Public_Engine_Mods, 28, 2)","v":1},{"$f":"INDEX(Public_Engine_Mods, 28, 3)","v":"Non-Factory Trim/modified header 1-6 cyl (pre-cat exhaust change)"},null,null,null,null,{"$f":"INDEX(Public_Suspension_Mods, 17, 2)","v":1},{"$f":"INDEX(Public_Suspension_Mods, 17, 3)","v":"Modify OEM torque bar"},null,null,null,null,{"$f":"INDEX(Public_Engine_Mods, 28, 4)","v":false},null,{"$f":"INDEX(Public_Suspension_Mods, 17, 4)","v":false}]
[{"$f":"INDEX(Public_Engine_Mods, 29, 2)","v":2},{"$f":"INDEX(Public_Engine_Mods, 29, 3)","v":"Non-Factory Trim/modified header 7-12 cyl (pre-cat exhaust change)"},null,null,null,null,{"$f":"INDEX(Public_Suspension_Mods, 18, 2)","v":1},{"$f":"INDEX(Public_Suspension_Mods, 18, 3)","v":"Non-Factory Trim suspension bushings or spherical bearings, except rubber or polyurethane"},null,null,null,null,{"$f":"INDEX(Public_Engine_Mods, 29, 4)","v":false},null,{"$f":"INDEX(Public_Suspension_Mods, 18, 4)","v":false}]
[{"$f":"INDEX(Public_Engine_Mods, 30, 2)","v":1},{"$f":"INDEX(Public_Engine_Mods, 30, 3)","v":"Non-Factory Trim/modified exhaust beyond the catalytic converter (e.g. cat back exhaust) "},null,null,null,null,null,null,null,null,null,null,{"$f":"INDEX(Public_Engine_Mods, 30, 4)","v":false}]
[{"$f":"INDEX(Public_Engine_Mods, 31, 2)","v":1},{"$f":"INDEX(Public_Engine_Mods, 31, 3)","v":"Non-Factory Trim/modified catalytic converter(s)"},null,null,null,null,{"$f":"INDEX(Public_Suspension_Mods, 19, 2)","v":1},{"$f":"INDEX(Public_Suspension_Mods, 19, 3)","v":"Non-Factory Trim/modified suspension components which enable alignment settings beyond Factory Trim capability (does not apply to coil springs, leaf springs, or torsion bars); note - additional points may need to be taken for specific non-Factory Trim suspension components if listed elsewhere in this section"},null,null,null,null,{"$f":"INDEX(Public_Engine_Mods, 31, 4)","v":false},null,{"$f":"INDEX(Public_Suspension_Mods, 19, 4)","v":false}]
[{"$f":"INDEX(Public_Engine_Mods, 32, 2)","v":1},{"$f":"INDEX(Public_Engine_Mods, 32, 3)","v":"Complete removal or “gutting” of OEM catalytic converter(s) (i.e. “test pipe” in place of catalytic converter)"},null,null,null,null,null,null,null,null,null,null,{"$f":"INDEX(Public_Engine_Mods, 32, 4)","v":false}]
[{"$f":"INDEX(Public_Engine_Mods, 33, 2)","v":1},{"$f":"INDEX(Public_Engine_Mods, 33, 3)","v":"Non-Factory Trim/modified power steering, crank pulley"},null,null,null,null,null,"External",null,null,null,null,{"$f":"INDEX(Public_Engine_Mods, 33, 4)","v":false},null,"External"]
[{"$f":"INDEX(Public_Engine_Mods, 34, 2)","v":1},{"$f":"INDEX(Public_Engine_Mods, 34, 3)","v":"Non-Factory Trim/modified/deleted engine or accessory fan and/or other engine accessories not otherwise listed"},null,null,null,null,{"$f":"INDEX(Public_Exterior_Mods, 1, 2)","v":1},{"$f":"INDEX(Public_Exterior_Mods, 1, 3)","v":"Non-Factory Trim/modified front bumper/air dam/spoiler"},null,null,null,null,{"$f":"INDEX(Public_Engine_Mods, 34, 4)","v":false},null,{"$f":"INDEX(Public_Exterior_Mods, 1, 4)","v":false}]
[{"$f":"INDEX(Public_Engine_Mods, 35, 2)","v":"Dyno"},{"$f":"INDEX(Public_Engine_Mods, 35, 3)","v":"Street Port, rotary engines"},null,null,null,null,{"$f":"INDEX(Public_Exterior_Mods, 2, 2)","v":1},{"$f":"INDEX(Public_Exterior_Mods, 2, 3)","v":"Non-Factory Trim/modified front splitter, in addition to bumper/air dam/spoiler"},null,null,null,null,{"$f":"INDEX(Public_Engine_Mods, 35, 4)","v":false},null,{"$f":"INDEX(Public_Exterior_Mods, 2, 4)","v":false}]
[{"$f":"INDEX(Public_Engine_Mods, 36, 2)","v":"Dyno"},{"$f":"INDEX(Public_Engine_Mods, 36, 3)","v":"Bridge Port, rotary engines"},null,null,null,null,{"$f":"INDEX(Public_Exterior_Mods, 3, 2)","v":2},{"$f":"INDEX(Public_Exterior_Mods, 3, 3)","v":"Non-Factory Trim/modified front splitter that extends more than 3.5 inches from front bumper skin leading edge, in addition to bumper/air dam/spoiler"},null,null,null,null,{"$f":"INDEX(Public_Engine_Mods, 36, 4)","v":false},null,{"$f":"INDEX(Public_Exterior_Mods, 3, 4)","v":false}]
[{"$f":"INDEX(Public_Engine_Mods, 37, 2)","v":"Dyno"},{"$f":"INDEX(Public_Engine_Mods, 37, 3)","v":"Peripheral Port, rotary engines"},null,null,null,null,null,null,null,null,null,null,{"$f":"INDEX(Public_Engine_Mods, 37, 4)","v":false}]
[{"$f":"INDEX(Public_Engine_Mods, 38, 2)","v":"Dyno"},{"$f":"INDEX(Public_Engine_Mods, 38, 3)","v":"Non-Factory Trim/modified Pistons, Rods"},null,null,null,null,{"$f":"INDEX(Public_Exterior_Mods, 4, 2)","v":1},{"$f":"INDEX(Public_Exterior_Mods, 4, 3)","v":"Non-Factory Trim/modified canards (each set assessed points front or rear)"},null,null,null,null,{"$f":"INDEX(Public_Engine_Mods, 38, 4)","v":false},null,{"$f":"INDEX(Public_Exterior_Mods, 4, 4)","v":false}]
[{"$f":"INDEX(Public_Engine_Mods, 39, 2)","v":"Dyno"},{"$f":"INDEX(Public_Engine_Mods, 39, 3)","v":"Vehicles tuned and running ethanol content greater than 15%. (E.g. a vehicle tuned to run on e85)"},null,null,null,null,{"$f":"INDEX(Public_Exterior_Mods, 5, 2)","v":1},{"$f":"INDEX(Public_Exterior_Mods, 5, 3)","v":"Non-Factory Trim Rear spoiler or wing including any airfoil that in no way protrudes more than 6” from the mounting location of the spoiler or wing, does not exceed the height of the vehicle, and does not extend beyond the width of the rear quarter panels"},null,null,null,null,{"$f":"INDEX(Public_Engine_Mods, 39, 4)","v":false},null,{"$f":"INDEX(Public_Exterior_Mods, 5, 4)","v":false}]
[{"$f":"INDEX(Public_Engine_Mods, 40, 2)","v":0},{"$f":"INDEX(Public_Engine_Mods, 40, 3)","v":"Any type of commercially available gasoline or diesel fuel"},null,null,null,null,{"$f":"INDEX(Public_Exterior_Mods, 6, 2)","v":2},{"$f":"INDEX(Public_Exterior_Mods, 6, 3)","v":"Non-Factory Trim Rear spoiler or wing including any airfoil that does not exceed the height of the vehicle, does not extend beyond the width of the rear quarter panels, and does not extend no more than 6\" beyond the skin of the rear bumper"},null,null,null,null,{"$f":"INDEX(Public_Engine_Mods, 40, 4)","v":false},null,{"$f":"INDEX(Public_Exterior_Mods, 6, 4)","v":false}]
[{"$f":"INDEX(Public_Engine_Mods, 41, 2)","v":0},{"$f":"INDEX(Public_Engine_Mods, 41, 3)","v":"Non-Factory Trim/modified fuses, relays, wiring, or addition of Power Distribution Modules"},null,null,null,null,null,null,null,null,null,null,{"$f":"INDEX(Public_Engine_Mods, 41, 4)","v":false}]
[{"$f":"INDEX(Public_Engine_Mods, 42, 2)","v":0},{"$f":"INDEX(Public_Engine_Mods, 42, 3)","v":"Non-Factory Trim hoses, belts, clamps"},null,null,null,null,{"$f":"INDEX(Public_Exterior_Mods, 7, 2)","v":3},{"$f":"INDEX(Public_Exterior_Mods, 7, 3)","v":"Non-Factory Trim Rear spoiler or wing including any air foil of any size or shape"},null,null,null,null,{"$f":"INDEX(Public_Engine_Mods, 42, 4)","v":false},null,{"$f":"INDEX(Public_Exterior_Mods, 7, 4)","v":false}]
[{"$f":"INDEX(Public_Engine_Mods, 43, 2)","v":0},{"$f":"INDEX(Public_Engine_Mods, 43, 3)","v":"Non-Factory Trim air or fuel filters"},null,null,null,null,null,null,null,null,null,null,{"$f":"INDEX(Public_Engine_Mods, 43, 4)","v":false}]
[null,"Brakes",null,null,null,null,{"$f":"INDEX(Public_Exterior_Mods, 8, 2)","v":1},{"$f":"INDEX(Public_Exterior_Mods, 8, 3)","v":"Non-Factory Trim hardtop of different shape and size which alters airflow aft of the OEM rear glass (eg CWest Honda S2000 aero hardtop)"},null,null,null,null,null,null,{"$f":"INDEX(Public_Exterior_Mods, 8, 4)","v":false}]
[{"$f":"INDEX(Public_Brake_Mods, 1, 2)","v":1},{"$f":"INDEX(Public_Brake_Mods, 1, 3)","v":"Non‐Factory Trim brake calipers, drums, and/or rotors of a different size ‐ front, rear or both"},null,null,null,null,{"$f":"INDEX(Public_Exterior_Mods, 10, 2)","v":1},{"$f":"INDEX(Public_Exterior_Mods, 10, 3)","v":"Non-Factory Trim/modified vortex generator to roof, hardtop, rear glass or trunk"},null,null,null,null,{"$f":"INDEX(Public_Brake_Mods, 1, 4)","v":false},null,{"$f":"INDEX(Public_Exterior_Mods, 10, 4)","v":false}]
[{"$f":"INDEX(Public_Brake_Mods, 2, 2)","v":2},{"$f":"INDEX(Public_Brake_Mods, 2, 3)","v":"Non-Factory Trim/modified ABS (e.g. Bosch Motorsport ABS)"},null,null,null,null,{"$f":"INDEX(Public_Exterior_Mods, 11, 2)","v":2},{"$f":"INDEX(Public_Exterior_Mods, 11, 3)","v":"Non-Factory Trim/modified flat bottom"},null,null,null,null,{"$f":"INDEX(Public_Brake_Mods, 2, 4)","v":false},null,{"$f":"INDEX(Public_Exterior_Mods, 11, 4)","v":false}]
[{"$f":"INDEX(Public_Brake_Mods, 3, 2)","v":-1},{"$f":"INDEX(Public_Brake_Mods, 3, 3)","v":"Disabling any and all factory and/or aftermarket ABS or competing in a vehicle not originally equipped with ABS"},null,null,null,null,{"$f":"INDEX(Public_Exterior_Mods, 12, 2)","v":2},{"$f":"INDEX(Public_Exterior_Mods, 12, 3)","v":"Non-Factory Trim/modified rear diffuser"},null,null,null,null,{"$f":"INDEX(Public_Brake_Mods, 3, 4)","v":false},null,{"$f":"INDEX(Public_Exterior_Mods, 12, 4)","v":false}]
[null,null,null,null,null,null,{"$f":"INDEX(Public_Exterior_Mods, 13, 2)","v":1},{"$f":"INDEX(Public_Exterior_Mods, 13, 3)","v":"Non-Factory Trim/modified side skirts"},null,null,null,null,null,null,{"$f":"INDEX(Public_Exterior_Mods, 13, 4)","v":false}]
[null,null,null,null,null,null,{"$f":"INDEX(Public_Exterior_Mods, 14, 2)","v":4},{"$f":"INDEX(Public_Exterior_Mods, 14, 3)","v":"Non-factory trim Active aero, i.e. moveable aero devices; points assessed for each piece, in addition to assessment points listed above"},null,null,null,null,null,null,{"$f":"INDEX(Public_Exterior_Mods, 14, 4)","v":false}]